Post Test
[2025-07-15T23:49:50.476Z] make[4]: Leaving directory '/home/jenkins/workspace/Test_openjdk17_hs_extended.openjdk_aarch64_linux_testList_0/aqa-tests/openjdk'
[2025-07-15T23:49:50.476Z] make[3]: Leaving directory '/home/jenkins/workspace/Test_openjdk17_hs_extended.openjdk_aarch64_linux_testList_0/aqa-tests'
[2025-07-15T23:49:50.476Z]
[2025-07-15T23:49:50.476Z]
[2025-07-15T23:49:50.476Z] All tests finished, run result summary:
[2025-07-15T23:49:50.476Z] cd "/home/jenkins/workspace/Test_openjdk17_hs_extended.openjdk_aarch64_linux_testList_0/aqa-tests/TKG/../TKG/scripts"; \
[2025-07-15T23:49:50.476Z] perl "resultsSum.pl" --failuremk="/home/jenkins/workspace/Test_openjdk17_hs_extended.openjdk_aarch64_linux_testList_0/aqa-tests/TKG/../TKG/failedtargets.mk" --resultFile="/home/jenkins/workspace/Test_openjdk17_hs_extended.openjdk_aarch64_linux_testList_0/aqa-tests/TKG/../TKG/output_17526170428676/TestTargetResult" --platFile="/home/jenkins/workspace/Test_openjdk17_hs_extended.openjdk_aarch64_linux_testList_0/aqa-tests/TKG/../TKG/resources/buildPlatformMap.properties" --diagnostic=failure --jdkVersion=17 --jdkImpl=hotspot --jdkVendor="eclipse" --spec=linux_aarch64 --buildList=openjdk --customTarget="" --testTarget=testList --tapPath=/home/jenkins/workspace/Test_openjdk17_hs_extended.openjdk_aarch64_linux_testList_0/aqa-tests/TKG/../TKG/output_17526170428676/ --tapName=Test_openjdk17_hs_extended.openjdk_aarch64_linux_testList_0.tap --comment=""
[2025-07-15T23:49:50.476Z]
[2025-07-15T23:49:50.476Z]
[2025-07-15T23:49:50.476Z] TEST TARGETS SUMMARY
[2025-07-15T23:49:50.476Z] ++++++++++++++++++++++++++++++++++++++++++++++++++++++++++++++++++++++++++
[2025-07-15T23:49:50.476Z] PASSED test targets:
[2025-07-15T23:49:50.476Z] hotspot_runtime_0 - Test results: passed: 927
[2025-07-15T23:49:50.476Z]
[2025-07-15T23:49:50.476Z] FAILED test targets:
[2025-07-15T23:49:50.476Z] jdk_security3_1 - Test results: passed: 745; failed: 126; error: 1
[2025-07-15T23:49:50.476Z] Failed test cases:
[2025-07-15T23:49:50.476Z] TEST: sun/security/tools/jarsigner/Warning.java
[2025-07-15T23:49:50.476Z] TEST: sun/security/tools/jarsigner/WasSignedByOtherSigner.java
[2025-07-15T23:49:50.476Z] TEST: sun/security/tools/jarsigner/WeakSize.java
[2025-07-15T23:49:50.476Z] TEST: sun/security/tools/keytool/fakecacerts/MyOwnCacerts.java
[2025-07-15T23:49:50.476Z] TEST: sun/security/tools/keytool/GroupName.java
[2025-07-15T23:49:50.476Z] TEST: sun/security/tools/keytool/HasSrcStoretypeOption.java
[2025-07-15T23:49:50.476Z] TEST: sun/security/tools/keytool/ImportPrompt.java
[2025-07-15T23:49:50.476Z] TEST: sun/security/tools/keytool/ImportReadAll.java
[2025-07-15T23:49:50.476Z] TEST: sun/security/tools/keytool/ImportToPwordlessPK12.java
[2025-07-15T23:49:50.476Z] TEST: sun/security/tools/keytool/JKStoPKCS12.java
[2025-07-15T23:49:50.476Z] TEST: sun/security/tools/keytool/KeyAlg.java
[2025-07-15T23:49:50.476Z] TEST: sun/security/tools/keytool/KeyToolTest.java
[2025-07-15T23:49:50.476Z] TEST: sun/security/tools/keytool/ListOrder.java
[2025-07-15T23:49:50.476Z] TEST: sun/security/tools/keytool/NewHelp.java
[2025-07-15T23:49:50.476Z] TEST: sun/security/tools/keytool/NewSize7.java
[2025-07-15T23:49:50.476Z] TEST: sun/security/tools/keytool/NoExtNPE.java
[2025-07-15T23:49:50.476Z] TEST: sun/security/tools/keytool/NssTest.java
[2025-07-15T23:49:50.476Z] TEST: sun/security/tools/keytool/PKCS12Passwd.java
[2025-07-15T23:49:50.476Z] TEST: sun/security/tools/keytool/PrintSSL.java
[2025-07-15T23:49:50.476Z] TEST: sun/security/tools/keytool/ProbingFailure.java
[2025-07-15T23:49:50.476Z] TEST: sun/security/tools/keytool/ReadJar.java
[2025-07-15T23:49:50.476Z] TEST: sun/security/tools/keytool/RealType.java
[2025-07-15T23:49:50.476Z] TEST: sun/security/tools/keytool/RemoveKeyAlgDefault.java
[2025-07-15T23:49:50.476Z] TEST: sun/security/tools/keytool/Resource.java
[2025-07-15T23:49:50.476Z] TEST: sun/security/tools/keytool/SecretKeyKS.java
[2025-07-15T23:49:50.476Z] TEST: sun/security/tools/keytool/SecurityToolsTest.java
[2025-07-15T23:49:50.476Z] TEST: sun/security/tools/keytool/SelfIssued.java
[2025-07-15T23:49:50.476Z] TEST: sun/security/tools/keytool/Serial64.java
[2025-07-15T23:49:50.476Z] TEST: sun/security/tools/keytool/StandardAlgName.java
[2025-07-15T23:49:50.476Z] TEST: sun/security/tools/keytool/StartDateTest.java
[2025-07-15T23:49:50.476Z] TEST: sun/security/tools/keytool/StorePasswords.java
[2025-07-15T23:49:50.476Z] TEST: sun/security/tools/keytool/TestSha1Usage.java
[2025-07-15T23:49:50.476Z] TEST: sun/security/tools/keytool/TryStore.java
[2025-07-15T23:49:50.476Z] TEST: sun/security/tools/keytool/UnknownAndUnparseable.java
[2025-07-15T23:49:50.476Z] TEST: sun/security/tools/keytool/WeakAlg.java
[2025-07-15T23:49:50.476Z] TEST: sun/security/util/AlgorithmConstraints/DecomposeAlgorithms.java
[2025-07-15T23:49:50.476Z] TEST: sun/security/util/Oid/OidEquals.java
[2025-07-15T23:49:50.476Z]
[2025-07-15T23:49:50.476Z] TOTAL: 2 EXECUTED: 2 PASSED: 1 FAILED: 1 DISABLED: 0 SKIPPED: 0
[2025-07-15T23:49:50.476Z] ++++++++++++++++++++++++++++++++++++++++++++++++++++++++++++++++++++++++++
[2025-07-15T23:49:50.476Z]
[2025-07-15T23:49:50.476Z] TESTCASES RESULTS SUMMARY: passed: 1,672; failed: 126; error: 1; skipped: 0
[2025-07-15T23:49:50.476Z] ++++++++++++++++++++++++++++++++++++++++++++++++++++++++++++++++++++++++++
[2025-07-15T23:49:50.476Z] make[2]: *** [settings.mk:454: resultsSummary] Error 2
[2025-07-15T23:49:50.476Z] make[2]: Leaving directory '/home/jenkins/workspace/Test_openjdk17_hs_extended.openjdk_aarch64_linux_testList_0/aqa-tests/TKG'
[2025-07-15T23:49:50.476Z] make[1]: *** [makefile:62: _testList] Error 2
[2025-07-15T23:49:50.476Z] make[1]: Leaving directory '/home/jenkins/workspace/Test_openjdk17_hs_extended.openjdk_aarch64_linux_testList_0/aqa-tests/TKG'
[2025-07-15T23:49:50.476Z] make: *** [parallelList.mk:8: testList_0] Error 2
[Pipeline] sh
[Pipeline] }
[2025-07-15T23:49:51.367Z] Xvfb stopping
[Pipeline] // wrap
[Pipeline] }
[Pipeline] // stage
[Pipeline] stage
[Pipeline] { (Post)
[Pipeline] step
[2025-07-15T23:49:51.996Z] TAP Reports Processing: START
[2025-07-15T23:49:51.997Z] Looking for TAP results report in workspace using pattern: aqa-tests/TKG/**/*.tap
[2025-07-15T23:49:53.331Z] Saving reports...
[2025-07-15T23:49:53.462Z] Processing '/home/jenkins/.jenkins/jobs/Test_openjdk17_hs_extended.openjdk_aarch64_linux_testList_0/builds/55/tap-master-files/aqa-tests/TKG/output_17526170428676/Test_openjdk17_hs_extended.openjdk_aarch64_linux_testList_0.tap'
[2025-07-15T23:49:53.462Z] Parsing TAP test result [/home/jenkins/.jenkins/jobs/Test_openjdk17_hs_extended.openjdk_aarch64_linux_testList_0/builds/55/tap-master-files/aqa-tests/TKG/output_17526170428676/Test_openjdk17_hs_extended.openjdk_aarch64_linux_testList_0.tap].
[2025-07-15T23:49:53.465Z] There are failed test cases. Marking build as UNSTABLE
[2025-07-15T23:49:53.465Z] TAP Reports Processing: FINISH
[Pipeline] echo
[2025-07-15T23:49:53.471Z] Saving aqa-tests/testenv/testenv.properties file on jenkins.
[Pipeline] archiveArtifacts
[2025-07-15T23:49:53.606Z] Archiving artifacts
[2025-07-15T23:49:53.869Z] Recording fingerprints
[Pipeline] echo
[2025-07-15T23:49:54.008Z] Saving aqa-tests/TKG/**/*.tap file on jenkins.
[Pipeline] archiveArtifacts
[2025-07-15T23:49:54.141Z] Archiving artifacts
[2025-07-15T23:49:55.530Z] Recording fingerprints
[Pipeline] sh
[Pipeline] }
[Pipeline] // stage
[Pipeline] echo
[2025-07-15T23:49:57.365Z] PROCESSCATCH: Terminating any hung/left over test processes:
[Pipeline] sh
[Pipeline] }
[Pipeline] // timeout
[Pipeline] echo
[2025-07-15T23:49:57.791Z] Exception: java.nio.file.FileSystemException: /home/jenkins/workspace/Test_openjdk17_hs_extended.openjdk_aarch64_linux_testList_0@tmp/durable-edeb3cc9: No space left on device
[Pipeline] timeout
[2025-07-15T23:49:57.796Z] Timeout set to expire in 5 min 0 sec
[Pipeline] {
[Pipeline] echo
[2025-07-15T23:49:57.809Z] Test_openjdk17_hs_extended.openjdk_aarch64_linux_testList_0 #55 result is FAILURE. Checking console log for specific errors...
[Pipeline] echo
[2025-07-15T23:49:57.913Z] Test_openjdk17_hs_extended.openjdk_aarch64_linux_testList_0 #55 failed on test-docker-ubuntu2204-armv8l-2 due to .*No space left on device.*: https://ci.adoptium.net/job/Test_openjdk17_hs_extended.openjdk_aarch64_linux_testList_0/55/
[2025-07-15T23:49:57.913Z] Set test-docker-ubuntu2204-armv8l-2 temporarily offline! https://ci.adoptium.net/computer/test-docker-ubuntu2204-armv8l-2
Scripts not permitted to use method hudson.model.Computer setTemporarilyOffline boolean hudson.slaves.OfflineCause. Administrators can decide whether to approve or reject this signature.
[Pipeline] }
[Pipeline] // timeout
[Pipeline] }
[Pipeline] // node
[Pipeline] }
[Pipeline] // stage
[Pipeline] }
[Pipeline] // timestamps
[Pipeline] End of Pipeline
Also: org.jenkinsci.plugins.workflow.actions.ErrorAction$ErrorId: 2bc383d5-b3fd-43e0-b897-97929d50fd36
org.jenkinsci.plugins.scriptsecurity.sandbox.RejectedAccessException: Scripts not permitted to use method hudson.model.Computer setTemporarilyOffline boolean hudson.slaves.OfflineCause
at PluginClassLoader for script-security//org.jenkinsci.plugins.scriptsecurity.sandbox.whitelists.StaticWhitelist.rejectMethod(StaticWhitelist.java:244)
at PluginClassLoader for script-security//org.jenkinsci.plugins.scriptsecurity.sandbox.groovy.SandboxInterceptor.rejectMethod(SandboxInterceptor.java:594)
at PluginClassLoader for script-security//org.jenkinsci.plugins.scriptsecurity.sandbox.groovy.SandboxInterceptor.onMethodCall(SandboxInterceptor.java:167)
at PluginClassLoader for script-security//org.kohsuke.groovy.sandbox.impl.Checker$1.call(Checker.java:178)
at PluginClassLoader for script-security//org.kohsuke.groovy.sandbox.impl.Checker.checkedCall(Checker.java:182)
at PluginClassLoader for workflow-cps//com.cloudbees.groovy.cps.sandbox.SandboxInvoker.methodCall(SandboxInvoker.java:17)
at PluginClassLoader for workflow-cps//org.jenkinsci.plugins.workflow.cps.LoggingInvoker.methodCall(LoggingInvoker.java:118)
at WorkflowScript.checkErrors(WorkflowScript:634)
at WorkflowScript.runTest(WorkflowScript:579)
at ___cps.transform___(Native Method)
at PluginClassLoader for workflow-cps//com.cloudbees.groovy.cps.impl.ContinuationGroup.methodCall(ContinuationGroup.java:90)
at PluginClassLoader for workflow-cps//com.cloudbees.groovy.cps.impl.FunctionCallBlock$ContinuationImpl.dispatchOrArg(FunctionCallBlock.java:114)
at PluginClassLoader for workflow-cps//com.cloudbees.groovy.cps.impl.FunctionCallBlock$ContinuationImpl.fixArg(FunctionCallBlock.java:83)
at jdk.internal.reflect.GeneratedMethodAccessor836.invoke(Unknown Source)
at java.base/jdk.internal.reflect.DelegatingMethodAccessorImpl.invoke(DelegatingMethodAccessorImpl.java:43)
at java.base/java.lang.reflect.Method.invoke(Method.java:569)
at PluginClassLoader for workflow-cps//com.cloudbees.groovy.cps.impl.ContinuationPtr$ContinuationImpl.receive(ContinuationPtr.java:72)
at PluginClassLoader for workflow-cps//com.cloudbees.groovy.cps.impl.FunctionCallBlock$ContinuationImpl.dispatchOrArg(FunctionCallBlock.java:108)
at PluginClassLoader for workflow-cps//com.cloudbees.groovy.cps.impl.FunctionCallBlock$ContinuationImpl.fixArg(FunctionCallBlock.java:83)
at jdk.internal.reflect.GeneratedMethodAccessor836.invoke(Unknown Source)
at java.base/jdk.internal.reflect.DelegatingMethodAccessorImpl.invoke(DelegatingMethodAccessorImpl.java:43)
at java.base/java.lang.reflect.Method.invoke(Method.java:569)
at PluginClassLoader for workflow-cps//com.cloudbees.groovy.cps.impl.ContinuationPtr$ContinuationImpl.receive(ContinuationPtr.java:72)
at PluginClassLoader for workflow-cps//com.cloudbees.groovy.cps.impl.FunctionCallBlock$ContinuationImpl.dispatchOrArg(FunctionCallBlock.java:108)
at PluginClassLoader for workflow-cps//com.cloudbees.groovy.cps.impl.FunctionCallBlock$ContinuationImpl.fixArg(FunctionCallBlock.java:83)
at jdk.internal.reflect.GeneratedMethodAccessor836.invoke(Unknown Source)
at java.base/jdk.internal.reflect.DelegatingMethodAccessorImpl.invoke(DelegatingMethodAccessorImpl.java:43)
at java.base/java.lang.reflect.Method.invoke(Method.java:569)
at PluginClassLoader for workflow-cps//com.cloudbees.groovy.cps.impl.ContinuationPtr$ContinuationImpl.receive(ContinuationPtr.java:72)
at PluginClassLoader for workflow-cps//com.cloudbees.groovy.cps.impl.CastBlock$ContinuationImpl.cast(CastBlock.java:47)
at jdk.internal.reflect.GeneratedMethodAccessor848.invoke(Unknown Source)
at java.base/jdk.internal.reflect.DelegatingMethodAccessorImpl.invoke(DelegatingMethodAccessorImpl.java:43)
at java.base/java.lang.reflect.Method.invoke(Method.java:569)
at PluginClassLoader for workflow-cps//com.cloudbees.groovy.cps.impl.ContinuationPtr$ContinuationImpl.receive(ContinuationPtr.java:72)
at PluginClassLoader for workflow-cps//com.cloudbees.groovy.cps.impl.CollectionLiteralBlock$ContinuationImpl.dispatch(CollectionLiteralBlock.java:55)
at PluginClassLoader for workflow-cps//com.cloudbees.groovy.cps.impl.CollectionLiteralBlock$ContinuationImpl.item(CollectionLiteralBlock.java:45)
at jdk.internal.reflect.GeneratedMethodAccessor839.invoke(Unknown Source)
at java.base/jdk.internal.reflect.DelegatingMethodAccessorImpl.invoke(DelegatingMethodAccessorImpl.java:43)
at java.base/java.lang.reflect.Method.invoke(Method.java:569)
at PluginClassLoader for workflow-cps//com.cloudbees.groovy.cps.impl.ContinuationPtr$ContinuationImpl.receive(ContinuationPtr.java:72)
at PluginClassLoader for workflow-cps//com.cloudbees.groovy.cps.impl.ConstantBlock.eval(ConstantBlock.java:21)
at PluginClassLoader for workflow-cps//com.cloudbees.groovy.cps.Next.step(Next.java:83)
at PluginClassLoader for workflow-cps//com.cloudbees.groovy.cps.Continuable.run0(Continuable.java:147)
at PluginClassLoader for workflow-cps//org.jenkinsci.plugins.workflow.cps.SandboxContinuable.access$001(SandboxContinuable.java:17)
at PluginClassLoader for workflow-cps//org.jenkinsci.plugins.workflow.cps.SandboxContinuable.run0(SandboxContinuable.java:49)
at PluginClassLoader for workflow-cps//org.jenkinsci.plugins.workflow.cps.CpsThread.runNextChunk(CpsThread.java:180)
at PluginClassLoader for workflow-cps//org.jenkinsci.plugins.workflow.cps.CpsThreadGroup.run(CpsThreadGroup.java:419)
at PluginClassLoader for workflow-cps//org.jenkinsci.plugins.workflow.cps.CpsThreadGroup$2.call(CpsThreadGroup.java:327)
at PluginClassLoader for workflow-cps//org.jenkinsci.plugins.workflow.cps.CpsThreadGroup$2.call(CpsThreadGroup.java:292)
at PluginClassLoader for workflow-cps//org.jenkinsci.plugins.workflow.cps.CpsVmExecutorService.lambda$wrap$4(CpsVmExecutorService.java:140)
at java.base/java.util.concurrent.FutureTask.run(FutureTask.java:264)
at hudson.remoting.SingleLaneExecutorService$1.run(SingleLaneExecutorService.java:139)
at jenkins.util.ContextResettingExecutorService$1.run(ContextResettingExecutorService.java:28)
at jenkins.security.ImpersonatingExecutorService$1.run(ImpersonatingExecutorService.java:68)
at jenkins.util.ErrorLoggingExecutorService.lambda$wrap$0(ErrorLoggingExecutorService.java:51)
at java.base/java.util.concurrent.Executors$RunnableAdapter.call(Executors.java:539)
at java.base/java.util.concurrent.FutureTask.run(FutureTask.java:264)
at java.base/java.util.concurrent.ThreadPoolExecutor.runWorker(ThreadPoolExecutor.java:1136)
at java.base/java.util.concurrent.ThreadPoolExecutor$Worker.run(ThreadPoolExecutor.java:635)
at PluginClassLoader for workflow-cps//org.jenkinsci.plugins.workflow.cps.CpsVmExecutorService$1.call(CpsVmExecutorService.java:53)
at PluginClassLoader for workflow-cps//org.jenkinsci.plugins.workflow.cps.CpsVmExecutorService$1.call(CpsVmExecutorService.java:50)
at org.codehaus.groovy.runtime.GroovyCategorySupport$ThreadCategoryInfo.use(GroovyCategorySupport.java:136)
at org.codehaus.groovy.runtime.GroovyCategorySupport.use(GroovyCategorySupport.java:275)
at PluginClassLoader for workflow-cps//org.jenkinsci.plugins.workflow.cps.CpsVmExecutorService.lambda$categoryThreadFactory$0(CpsVmExecutorService.java:50)
at java.base/java.lang.Thread.run(Thread.java:840)
Finished: FAILURE