PatMod_Unex_2
[2025-07-15T22:51:11.675Z] Running test PatMod_Unex_2 ...
[2025-07-15T22:51:11.675Z] ===============================================
[2025-07-15T22:51:11.675Z] PatMod_Unex_2 Start Time: Tue Jul 15 22:51:11 2025 Epoch Time (ms): 1752619871118
[2025-07-15T22:51:11.675Z] variation: Mode1000
[2025-07-15T22:51:11.675Z] JVM_OPTIONS:
[2025-07-15T22:51:11.675Z] { \
[2025-07-15T22:51:11.675Z] echo ""; echo "TEST SETUP:"; \
[2025-07-15T22:51:11.675Z] echo "Nothing to be done for setup."; \
[2025-07-15T22:51:11.675Z] mkdir -p "/home/jenkins/workspace/Test_openjdk17_hs_sanity.system_arm_linux_testList_1/aqa-tests/TKG/../TKG/output_17526194277625/PatMod_Unex_2"; \
[2025-07-15T22:51:11.675Z] cd "/home/jenkins/workspace/Test_openjdk17_hs_sanity.system_arm_linux_testList_1/aqa-tests/TKG/../TKG/output_17526194277625/PatMod_Unex_2"; \
[2025-07-15T22:51:11.675Z] echo ""; echo "TESTING:"; \
[2025-07-15T22:51:11.675Z] perl /home/jenkins/workspace/Test_openjdk17_hs_sanity.system_arm_linux_testList_1/aqa-tests/TKG/../../jvmtest/system/modularity/..//STF/stf.core/scripts/stf.pl -test-root="/home/jenkins/workspace/Test_openjdk17_hs_sanity.system_arm_linux_testList_1/aqa-tests/TKG/../../jvmtest/system/modularity/..//STF;/home/jenkins/workspace/Test_openjdk17_hs_sanity.system_arm_linux_testList_1/aqa-tests/TKG/../../jvmtest/system/modularity/..//aqa-systemtest""" -systemtest-prereqs="/home/jenkins/workspace/Test_openjdk17_hs_sanity.system_arm_linux_testList_1/../../testDependency/system_lib/" -java-args=' ' -results-root="/home/jenkins/workspace/Test_openjdk17_hs_sanity.system_arm_linux_testList_1/aqa-tests/TKG/../TKG/output_17526194277625/PatMod_Unex_2" -test=PatModTest -test-args="variant=Unex"; \
[2025-07-15T22:51:11.675Z] if [ $? -eq 0 ]; then echo "-----------------------------------"; echo "PatMod_Unex_2""_PASSED"; echo "-----------------------------------"; cd /home/jenkins/workspace/Test_openjdk17_hs_sanity.system_arm_linux_testList_1/aqa-tests/TKG/..; rm -f -r "/home/jenkins/workspace/Test_openjdk17_hs_sanity.system_arm_linux_testList_1/aqa-tests/TKG/../TKG/output_17526194277625/PatMod_Unex_2"; else echo "-----------------------------------"; echo "PatMod_Unex_2""_FAILED"; echo "-----------------------------------"; fi; \
[2025-07-15T22:51:11.675Z] echo ""; echo "TEST TEARDOWN:"; \
[2025-07-15T22:51:11.675Z] echo "Nothing to be done for teardown."; \
[2025-07-15T22:51:11.675Z] } 2>&1 | tee -a "/home/jenkins/workspace/Test_openjdk17_hs_sanity.system_arm_linux_testList_1/aqa-tests/TKG/../TKG/output_17526194277625/TestTargetResult";
[2025-07-15T22:51:11.675Z]
[2025-07-15T22:51:11.675Z] TEST SETUP:
[2025-07-15T22:51:11.675Z] Nothing to be done for setup.
[2025-07-15T22:51:11.675Z]
[2025-07-15T22:51:11.675Z] TESTING:
[2025-07-15T22:51:11.675Z] STF 22:51:11.375 - ========================= S T F =========================
[2025-07-15T22:51:11.675Z] systemtest-prereqs has been processed, and set to: /home/jenkins/testDependency/system_libRetrieving amount of free space on drive containing /home/jenkins/workspace/Test_openjdk17_hs_sanity.system_arm_linux_testList_1/aqa-tests/TKG/../TKG/output_17526194277625/PatMod_Unex_2
[2025-07-15T22:51:11.675Z] There is 530609 Mb free
[2025-07-15T22:51:11.675Z] STF 22:51:11.397 - ================== G E N E R A T I O N ==================
[2025-07-15T22:51:11.675Z] STF 22:51:11.397 - Checking JVM: /home/jenkins/workspace/Test_openjdk17_hs_sanity.system_arm_linux_testList_1/jdkbinary/j2sdk-image
[2025-07-15T22:51:11.675Z] STF 22:51:11.398 - Starting process to generate scripts: /home/jenkins/workspace/Test_openjdk17_hs_sanity.system_arm_linux_testList_1/jdkbinary/j2sdk-image/bin/java -Dlog4j.skipJansi=true -Djava.system.class.loader=net.adoptopenjdk.stf.runner.StfClassLoader -Dload.agent.path=/home/jenkins/workspace/Test_openjdk17_hs_sanity.system_arm_linux_testList_1/jvmtest/system/STF/stf.core/scripts/../../stf.load/bin/stf.load.jar -classpath /home/jenkins/workspace/Test_openjdk17_hs_sanity.system_arm_linux_testList_1/../../testDependency/system_lib//asm/asm.jar:/home/jenkins/workspace/Test_openjdk17_hs_sanity.system_arm_linux_testList_1/../../testDependency/system_lib//asm/asm-commons.jar:/home/jenkins/workspace/Test_openjdk17_hs_sanity.system_arm_linux_testList_1/../../testDependency/system_lib//log4j/log4j-api.jar:/home/jenkins/workspace/Test_openjdk17_hs_sanity.system_arm_linux_testList_1/../../testDependency/system_lib//log4j/log4j-core.jar:/home/jenkins/workspace/Test_openjdk17_hs_sanity.system_arm_linux_testList_1/jvmtest/system/STF/stf.core/scripts/../bin net.adoptopenjdk.stf.runner.StfRunner -properties "/home/jenkins/workspace/Test_openjdk17_hs_sanity.system_arm_linux_testList_1/aqa-tests/TKG/../TKG/output_17526194277625/PatMod_Unex_2/20250715-225111-PatModTest/stf_parameters.properties, , /home/jenkins/workspace/Test_openjdk17_hs_sanity.system_arm_linux_testList_1/jvmtest/system/STF/stf.core/config/stf.properties" -testDir "/home/jenkins/workspace/Test_openjdk17_hs_sanity.system_arm_linux_testList_1/aqa-tests/TKG/../TKG/output_17526194277625/PatMod_Unex_2/20250715-225111-PatModTest"
[2025-07-15T22:51:11.675Z] GEN stderr OpenJDK Server VM warning: Archived non-system classes are disabled because the java.system.class.loader property is specified (value = "net.adoptopenjdk.stf.runner.StfClassLoader"). To use archived non-system classes, this property must not be set
[2025-07-15T22:51:17.395Z] GEN 22:51:16.316 - Found test. Project: 'openjdk.test.modularity' class: 'PatModTest.class' Dir: '/home/jenkins/workspace/Test_openjdk17_hs_sanity.system_arm_linux_testList_1/jvmtest/system/aqa-systemtest/openjdk.test.modularity/bin'
[2025-07-15T22:51:17.396Z] GEN 22:51:16.340 - Found test. Project: 'openjdk.test.modularity' class: 'net.adoptopenjdk.test.modularity.PatModTest'
[2025-07-15T22:51:18.174Z] GEN Classpath directories used by project 'openjdk.test.modularity':
[2025-07-15T22:51:18.174Z] GEN /home/jenkins/workspace/Test_openjdk17_hs_sanity.system_arm_linux_testList_1/jvmtest/system/aqa-systemtest/openjdk.test.modularity/bin/common-mods/displayService
[2025-07-15T22:51:18.174Z] GEN /home/jenkins/workspace/Test_openjdk17_hs_sanity.system_arm_linux_testList_1/jvmtest/system/aqa-systemtest/openjdk.test.modularity/bin/common-mods/com.helper
[2025-07-15T22:51:18.174Z] GEN /home/jenkins/workspace/Test_openjdk17_hs_sanity.system_arm_linux_testList_1/jvmtest/system/aqa-systemtest/openjdk.test.modularity/bin/common-mods/displayServiceImpl1
[2025-07-15T22:51:18.174Z] GEN /home/jenkins/workspace/Test_openjdk17_hs_sanity.system_arm_linux_testList_1/jvmtest/system/aqa-systemtest/openjdk.test.modularity/bin/common-mods/com.discreet
[2025-07-15T22:51:18.174Z] GEN /home/jenkins/workspace/Test_openjdk17_hs_sanity.system_arm_linux_testList_1/jvmtest/system/aqa-systemtest/openjdk.test.modularity/bin/common-mods/com.hello
[2025-07-15T22:51:18.174Z] GEN /home/jenkins/workspace/Test_openjdk17_hs_sanity.system_arm_linux_testList_1/jvmtest/system/aqa-systemtest/openjdk.test.modularity/bin/common-mods/com.hola
[2025-07-15T22:51:18.174Z] GEN /home/jenkins/workspace/Test_openjdk17_hs_sanity.system_arm_linux_testList_1/jvmtest/system/aqa-systemtest/openjdk.test.modularity/bin/common-mods/displayServiceImpl2
[2025-07-15T22:51:18.174Z] GEN /home/jenkins/workspace/Test_openjdk17_hs_sanity.system_arm_linux_testList_1/jvmtest/system/aqa-systemtest/openjdk.test.modularity/bin/common-mods/com.hi
[2025-07-15T22:51:18.174Z] GEN /home/jenkins/workspace/Test_openjdk17_hs_sanity.system_arm_linux_testList_1/jvmtest/system/aqa-systemtest/openjdk.test.modularity/bin/common-override
[2025-07-15T22:51:18.174Z] GEN /home/jenkins/workspace/Test_openjdk17_hs_sanity.system_arm_linux_testList_1/jvmtest/system/aqa-systemtest/openjdk.test.modularity/bin/common-override-new
[2025-07-15T22:51:18.174Z] GEN /home/jenkins/workspace/Test_openjdk17_hs_sanity.system_arm_linux_testList_1/jvmtest/system/aqa-systemtest/openjdk.test.modularity/bin/common/displayServiceImpl3
[2025-07-15T22:51:18.174Z] GEN /home/jenkins/workspace/Test_openjdk17_hs_sanity.system_arm_linux_testList_1/jvmtest/system/aqa-systemtest/openjdk.test.modularity/bin/common/displayServiceImpl4
[2025-07-15T22:51:18.174Z] GEN /home/jenkins/workspace/Test_openjdk17_hs_sanity.system_arm_linux_testList_1/jvmtest/system/aqa-systemtest/openjdk.test.modularity/bin/common
[2025-07-15T22:51:18.174Z] GEN /home/jenkins/workspace/Test_openjdk17_hs_sanity.system_arm_linux_testList_1/jvmtest/system/aqa-systemtest/openjdk.test.modularity/bin/tests
[2025-07-15T22:51:18.174Z] GEN /home/jenkins/workspace/Test_openjdk17_hs_sanity.system_arm_linux_testList_1/jvmtest/system/aqa-systemtest/openjdk.test.modularity/bin
[2025-07-15T22:51:18.174Z] GEN /home/jenkins/workspace/Test_openjdk17_hs_sanity.system_arm_linux_testList_1/jvmtest/system/STF/stf.core/bin
[2025-07-15T22:51:18.174Z] GEN /home/jenkins/testDependency/system_lib/log4j/log4j-api.jar
[2025-07-15T22:51:18.174Z] GEN /home/jenkins/testDependency/system_lib/log4j/log4j-core.jar
[2025-07-15T22:51:18.174Z] GEN /home/jenkins/testDependency/system_lib/junit/junit.jar
[2025-07-15T22:51:18.174Z] GEN 22:51:17.573 - Using Mode NoOptions. Values = ''
[2025-07-15T22:51:18.912Z] GEN 22:51:18.148 -
[2025-07-15T22:51:18.912Z] GEN 22:51:18.148 - Test command summary:
[2025-07-15T22:51:18.912Z] GEN 22:51:18.148 - Step Stage Command Description
[2025-07-15T22:51:18.912Z] GEN 22:51:18.148 - -----+--------+-----------------+------------
[2025-07-15T22:51:18.912Z] GEN 22:51:18.148 - 1 execute jar Create com.hello jar
[2025-07-15T22:51:18.912Z] GEN 22:51:18.148 - 2 execute jar Create com.discreet jar
[2025-07-15T22:51:18.912Z] GEN 22:51:18.148 - 3 execute jar create java.xml.jar
[2025-07-15T22:51:18.912Z] GEN 22:51:18.148 - 4 execute Run java (Negative test) Include a new package that is not exported and ensure the public type cannot be accessed
[2025-07-15T22:51:18.912Z] GEN 22:51:18.148 - 5 execute count Check output
[2025-07-15T22:51:18.912Z] GEN 22:51:18.149 - 6 execute Run java Include a new package that is not exported and check if the public type can be accessed by adding --add-exports
[2025-07-15T22:51:18.912Z] STF 22:51:18.256 -
[2025-07-15T22:51:18.912Z] STF 22:51:18.256 - Script generation completed
[2025-07-15T22:51:18.912Z] STF 22:51:18.256 -
[2025-07-15T22:51:18.912Z] STF 22:51:18.256 -
[2025-07-15T22:51:18.912Z] STF 22:51:18.256 - ======================= S E T U P =======================
[2025-07-15T22:51:18.912Z] STF 22:51:18.256 - Running setup: perl /home/jenkins/workspace/Test_openjdk17_hs_sanity.system_arm_linux_testList_1/aqa-tests/TKG/../TKG/output_17526194277625/PatMod_Unex_2/20250715-225111-PatModTest/setUp.pl
[2025-07-15T22:51:18.912Z] STF 22:51:18.465 - SETUP stage completed
[2025-07-15T22:51:18.912Z] STF 22:51:18.471 -
[2025-07-15T22:51:18.912Z] STF 22:51:18.471 - ==================== E X E C U T E - ====================
[2025-07-15T22:51:18.912Z] STF 22:51:18.471 - Running execute: perl /home/jenkins/workspace/Test_openjdk17_hs_sanity.system_arm_linux_testList_1/aqa-tests/TKG/../TKG/output_17526194277625/PatMod_Unex_2/20250715-225111-PatModTest/execute.pl
[2025-07-15T22:51:18.912Z] STF 22:51:18.606 -
[2025-07-15T22:51:18.912Z] STF 22:51:18.606 - Java version
[2025-07-15T22:51:18.912Z] STF 22:51:18.606 - Running: /home/jenkins/workspace/Test_openjdk17_hs_sanity.system_arm_linux_testList_1/jdkbinary/j2sdk-image/bin/java -version
[2025-07-15T22:51:19.653Z] openjdk version "17.0.16" 2025-07-15
[2025-07-15T22:51:19.653Z] OpenJDK Runtime Environment Temurin-17.0.16+8 (build 17.0.16+8)
[2025-07-15T22:51:19.653Z] OpenJDK Server VM Temurin-17.0.16+8 (build 17.0.16+8, mixed mode, sharing)
[2025-07-15T22:51:19.653Z] STF 22:51:19.020 -
[2025-07-15T22:51:19.653Z] STF 22:51:19.020 - +------ Step 1 - Create com.hello jar
[2025-07-15T22:51:19.653Z] STF 22:51:19.020 - | Create modular jar
[2025-07-15T22:51:19.653Z] STF 22:51:19.020 - | ModuleSpec: openjdk.test.modularity/bin/common-override/com.hello
[2025-07-15T22:51:19.653Z] STF 22:51:19.020 - | ModuleVersion: null
[2025-07-15T22:51:19.653Z] STF 22:51:19.020 - | MainClass: null
[2025-07-15T22:51:19.653Z] STF 22:51:19.020 - | HashModules: null
[2025-07-15T22:51:19.653Z] STF 22:51:19.020 - |
[2025-07-15T22:51:19.653Z] STF 22:51:19.020 - Running command: /home/jenkins/workspace/Test_openjdk17_hs_sanity.system_arm_linux_testList_1/jdkbinary/j2sdk-image/bin/jar --create --file /home/jenkins/workspace/Test_openjdk17_hs_sanity.system_arm_linux_testList_1/aqa-tests/TKG/output_17526194277625/PatMod_Unex_2/20250715-225111-PatModTest/modules/1.com.hello.jar -C /home/jenkins/workspace/Test_openjdk17_hs_sanity.system_arm_linux_testList_1/jvmtest/system/aqa-systemtest/openjdk.test.modularity/bin/common-override/com.hello .
[2025-07-15T22:51:19.653Z] STF 22:51:19.020 - Redirecting stderr to /home/jenkins/workspace/Test_openjdk17_hs_sanity.system_arm_linux_testList_1/aqa-tests/TKG/output_17526194277625/PatMod_Unex_2/20250715-225111-PatModTest/results/1.CMJ.stderr
[2025-07-15T22:51:19.653Z] STF 22:51:19.020 - Redirecting stdout to /home/jenkins/workspace/Test_openjdk17_hs_sanity.system_arm_linux_testList_1/aqa-tests/TKG/output_17526194277625/PatMod_Unex_2/20250715-225111-PatModTest/results/1.CMJ.stdout
[2025-07-15T22:51:19.653Z] STF 22:51:19.034 - Monitoring processes: CMJ
[2025-07-15T22:51:20.402Z] STF 22:51:20.085 - Monitoring Report Summary:
[2025-07-15T22:51:20.402Z] STF 22:51:20.085 - o Process CMJ ended with the expected exit code (0)
[2025-07-15T22:51:20.402Z] STF 22:51:20.085 - Created modular jar: 1.com.hello.jar
[2025-07-15T22:51:20.402Z] STF 22:51:20.085 -
[2025-07-15T22:51:20.402Z] STF 22:51:20.085 - +------ Step 2 - Create com.discreet jar
[2025-07-15T22:51:20.402Z] STF 22:51:20.085 - | Create modular jar
[2025-07-15T22:51:20.402Z] STF 22:51:20.085 - | ModuleSpec: openjdk.test.modularity/bin/common-override/com.discreet
[2025-07-15T22:51:20.402Z] STF 22:51:20.085 - | ModuleVersion: null
[2025-07-15T22:51:20.402Z] STF 22:51:20.085 - | MainClass: null
[2025-07-15T22:51:20.402Z] STF 22:51:20.085 - | HashModules: null
[2025-07-15T22:51:20.402Z] STF 22:51:20.085 - |
[2025-07-15T22:51:20.402Z] STF 22:51:20.086 - Running command: /home/jenkins/workspace/Test_openjdk17_hs_sanity.system_arm_linux_testList_1/jdkbinary/j2sdk-image/bin/jar --create --file /home/jenkins/workspace/Test_openjdk17_hs_sanity.system_arm_linux_testList_1/aqa-tests/TKG/output_17526194277625/PatMod_Unex_2/20250715-225111-PatModTest/modules/2.com.discreet.jar -C /home/jenkins/workspace/Test_openjdk17_hs_sanity.system_arm_linux_testList_1/jvmtest/system/aqa-systemtest/openjdk.test.modularity/bin/common-override/com.discreet .
[2025-07-15T22:51:20.402Z] STF 22:51:20.086 - Redirecting stderr to /home/jenkins/workspace/Test_openjdk17_hs_sanity.system_arm_linux_testList_1/aqa-tests/TKG/output_17526194277625/PatMod_Unex_2/20250715-225111-PatModTest/results/2.CMJ.stderr
[2025-07-15T22:51:20.402Z] STF 22:51:20.086 - Redirecting stdout to /home/jenkins/workspace/Test_openjdk17_hs_sanity.system_arm_linux_testList_1/aqa-tests/TKG/output_17526194277625/PatMod_Unex_2/20250715-225111-PatModTest/results/2.CMJ.stdout
[2025-07-15T22:51:20.402Z] STF 22:51:20.087 - Monitoring processes: CMJ
[2025-07-15T22:51:21.937Z] STF 22:51:21.206 - Monitoring Report Summary:
[2025-07-15T22:51:21.937Z] STF 22:51:21.206 - o Process CMJ ended with the expected exit code (0)
[2025-07-15T22:51:21.937Z] STF 22:51:21.206 - Created modular jar: 2.com.discreet.jar
[2025-07-15T22:51:21.937Z] STF 22:51:21.206 -
[2025-07-15T22:51:21.937Z] STF 22:51:21.206 - +------ Step 3 - create java.xml.jar
[2025-07-15T22:51:21.937Z] STF 22:51:21.206 - | Create modular jar
[2025-07-15T22:51:21.937Z] STF 22:51:21.206 - | ModuleSpec: openjdk.test.modularity/bin/common-override/java.xml
[2025-07-15T22:51:21.937Z] STF 22:51:21.206 - | ModuleVersion: null
[2025-07-15T22:51:21.937Z] STF 22:51:21.206 - | MainClass: null
[2025-07-15T22:51:21.937Z] STF 22:51:21.206 - | HashModules: null
[2025-07-15T22:51:21.937Z] STF 22:51:21.206 - |
[2025-07-15T22:51:21.937Z] STF 22:51:21.207 - Running command: /home/jenkins/workspace/Test_openjdk17_hs_sanity.system_arm_linux_testList_1/jdkbinary/j2sdk-image/bin/jar --create --file /home/jenkins/workspace/Test_openjdk17_hs_sanity.system_arm_linux_testList_1/aqa-tests/TKG/output_17526194277625/PatMod_Unex_2/20250715-225111-PatModTest/modules/3.java.xml.jar -C /home/jenkins/workspace/Test_openjdk17_hs_sanity.system_arm_linux_testList_1/jvmtest/system/aqa-systemtest/openjdk.test.modularity/bin/common-override/java.xml .
[2025-07-15T22:51:21.937Z] STF 22:51:21.207 - Redirecting stderr to /home/jenkins/workspace/Test_openjdk17_hs_sanity.system_arm_linux_testList_1/aqa-tests/TKG/output_17526194277625/PatMod_Unex_2/20250715-225111-PatModTest/results/3.CMJ.stderr
[2025-07-15T22:51:21.937Z] STF 22:51:21.207 - Redirecting stdout to /home/jenkins/workspace/Test_openjdk17_hs_sanity.system_arm_linux_testList_1/aqa-tests/TKG/output_17526194277625/PatMod_Unex_2/20250715-225111-PatModTest/results/3.CMJ.stdout
[2025-07-15T22:51:21.937Z] STF 22:51:21.208 - Monitoring processes: CMJ
[2025-07-15T22:51:22.681Z] STF 22:51:22.188 - Monitoring Report Summary:
[2025-07-15T22:51:22.681Z] STF 22:51:22.188 - o Process CMJ ended with the expected exit code (0)
[2025-07-15T22:51:22.681Z] STF 22:51:22.188 - Created modular jar: 3.java.xml.jar
[2025-07-15T22:51:22.681Z] STF 22:51:22.188 -
[2025-07-15T22:51:22.681Z] STF 22:51:22.188 - +------ Step 4 - (Negative test) Include a new package that is not exported and ensure the public type cannot be accessed
[2025-07-15T22:51:22.681Z] STF 22:51:22.188 - | Run foreground process
[2025-07-15T22:51:22.681Z] STF 22:51:22.188 - | Program: /home/jenkins/workspace/Test_openjdk17_hs_sanity.system_arm_linux_testList_1/jdkbinary/j2sdk-image/bin/java
[2025-07-15T22:51:22.681Z] STF 22:51:22.188 - | Mnemonic: OT3
[2025-07-15T22:51:22.681Z] STF 22:51:22.188 - | Echo: ECHO_ON
[2025-07-15T22:51:22.681Z] STF 22:51:22.188 - | Expectation: NON_ZERO_EXIT [1] within 1m
[2025-07-15T22:51:22.681Z] STF 22:51:22.188 - |
[2025-07-15T22:51:22.681Z] STF 22:51:22.189 - Running command: /home/jenkins/workspace/Test_openjdk17_hs_sanity.system_arm_linux_testList_1/jdkbinary/j2sdk-image/bin/java --add-reads com.test=ALL-UNNAMED --module-path /home/jenkins/workspace/Test_openjdk17_hs_sanity.system_arm_linux_testList_1/jvmtest/system/aqa-systemtest/openjdk.test.modularity/bin/common-mods:/home/jenkins/workspace/Test_openjdk17_hs_sanity.system_arm_linux_testList_1/jvmtest/system/aqa-systemtest/openjdk.test.modularity/bin/tests --add-modules=com.test --patch-module com.hello=/home/jenkins/workspace/Test_openjdk17_hs_sanity.system_arm_linux_testList_1/aqa-tests/TKG/output_17526194277625/PatMod_Unex_2/20250715-225111-PatModTest/modules/1.com.hello.jar -classpath /home/jenkins/testDependency/system_lib/junit/junit.jar:/home/jenkins/testDependency/system_lib/junit/hamcrest-core.jar org.junit.runner.JUnitCore net.adoptopenjdk.test.modularity.junit.TestOverrideUsingAppModuleAndNewPackage
[2025-07-15T22:51:22.681Z] STF 22:51:22.189 - Redirecting stderr to /home/jenkins/workspace/Test_openjdk17_hs_sanity.system_arm_linux_testList_1/aqa-tests/TKG/output_17526194277625/PatMod_Unex_2/20250715-225111-PatModTest/results/4.OT3.stderr
[2025-07-15T22:51:22.681Z] STF 22:51:22.189 - Redirecting stdout to /home/jenkins/workspace/Test_openjdk17_hs_sanity.system_arm_linux_testList_1/aqa-tests/TKG/output_17526194277625/PatMod_Unex_2/20250715-225111-PatModTest/results/4.OT3.stdout
[2025-07-15T22:51:22.681Z] STF 22:51:22.190 - Monitoring processes: OT3
[2025-07-15T22:51:23.421Z] OT3 stderr WARNING: module-info.class ignored in patch: /home/jenkins/workspace/Test_openjdk17_hs_sanity.system_arm_linux_testList_1/aqa-tests/TKG/output_17526194277625/PatMod_Unex_2/20250715-225111-PatModTest/modules/1.com.hello.jar
[2025-07-15T22:51:24.159Z] OT3 JUnit version 4.12
[2025-07-15T22:51:24.900Z] OT3 .E
[2025-07-15T22:51:24.900Z] OT3 Time: 0.096
[2025-07-15T22:51:24.900Z] OT3 There was 1 failure:
[2025-07-15T22:51:24.900Z] OT3 1) testOverrideUsingAppModuleAndNewPackage(net.adoptopenjdk.test.modularity.junit.TestOverrideUsingAppModuleAndNewPackage)
[2025-07-15T22:51:24.900Z] OT3 java.lang.IllegalAccessException: class net.adoptopenjdk.test.modularity.junit.TestOverrideUsingAppModuleAndNewPackage (in module com.test) cannot access class adoptopenjdk.test.modularity.hellonew.HelloNew (in module com.hello) because module com.hello does not export adoptopenjdk.test.modularity.hellonew to module com.test
[2025-07-15T22:51:24.901Z] OT3 at java.base/jdk.internal.reflect.Reflection.newIllegalAccessException(Reflection.java:392)
[2025-07-15T22:51:24.901Z] OT3 at java.base/java.lang.reflect.AccessibleObject.checkAccess(AccessibleObject.java:674)
[2025-07-15T22:51:24.901Z] OT3 at java.base/java.lang.reflect.Constructor.newInstanceWithCaller(Constructor.java:490)
[2025-07-15T22:51:24.901Z] OT3 at java.base/java.lang.reflect.Constructor.newInstance(Constructor.java:481)
[2025-07-15T22:51:24.901Z] OT3 at com.test/net.adoptopenjdk.test.modularity.junit.TestOverrideUsingAppModuleAndNewPackage.testOverrideUsingAppModuleAndNewPackage(TestOverrideUsingAppModuleAndNewPackage.java:31)
[2025-07-15T22:51:24.901Z] OT3 at java.base/jdk.internal.reflect.NativeMethodAccessorImpl.invoke0(Native Method)
[2025-07-15T22:51:24.901Z] OT3 at java.base/jdk.internal.reflect.NativeMethodAccessorImpl.invoke(NativeMethodAccessorImpl.java:77)
[2025-07-15T22:51:24.901Z] OT3 at java.base/jdk.internal.reflect.DelegatingMethodAccessorImpl.invoke(DelegatingMethodAccessorImpl.java:43)
[2025-07-15T22:51:24.901Z] OT3 at java.base/java.lang.reflect.Method.invoke(Method.java:569)
[2025-07-15T22:51:24.901Z] OT3 at org.junit.runners.model.FrameworkMethod$1.runReflectiveCall(FrameworkMethod.java:50)
[2025-07-15T22:51:24.901Z] OT3 at org.junit.internal.runners.model.ReflectiveCallable.run(ReflectiveCallable.java:12)
[2025-07-15T22:51:24.901Z] OT3 at org.junit.runners.model.FrameworkMethod.invokeExplosively(FrameworkMethod.java:47)
[2025-07-15T22:51:24.901Z] OT3 at org.junit.internal.runners.statements.InvokeMethod.evaluate(InvokeMethod.java:17)
[2025-07-15T22:51:24.901Z] OT3 at org.junit.runners.ParentRunner.runLeaf(ParentRunner.java:325)
[2025-07-15T22:51:24.901Z] OT3 at org.junit.runners.BlockJUnit4ClassRunner.runChild(BlockJUnit4ClassRunner.java:78)
[2025-07-15T22:51:24.901Z] OT3 at org.junit.runners.BlockJUnit4ClassRunner.runChild(BlockJUnit4ClassRunner.java:57)
[2025-07-15T22:51:24.901Z] OT3 at org.junit.runners.ParentRunner$3.run(ParentRunner.java:290)
[2025-07-15T22:51:24.901Z] OT3 at org.junit.runners.ParentRunner$1.schedule(ParentRunner.java:71)
[2025-07-15T22:51:24.901Z] OT3 at org.junit.runners.ParentRunner.runChildren(ParentRunner.java:288)
[2025-07-15T22:51:24.901Z] OT3 at org.junit.runners.ParentRunner.access$000(ParentRunner.java:58)
[2025-07-15T22:51:24.901Z] OT3 at org.junit.runners.ParentRunner$2.evaluate(ParentRunner.java:268)
[2025-07-15T22:51:24.901Z] OT3 at org.junit.runners.ParentRunner.run(ParentRunner.java:363)
[2025-07-15T22:51:24.901Z] OT3 at org.junit.runners.Suite.runChild(Suite.java:128)
[2025-07-15T22:51:24.901Z] OT3 at org.junit.runners.Suite.runChild(Suite.java:27)
[2025-07-15T22:51:24.901Z] OT3 at org.junit.runners.ParentRunner$3.run(ParentRunner.java:290)
[2025-07-15T22:51:24.901Z] OT3 at org.junit.runners.ParentRunner$1.schedule(ParentRunner.java:71)
[2025-07-15T22:51:24.901Z] OT3 at org.junit.runners.ParentRunner.runChildren(ParentRunner.java:288)
[2025-07-15T22:51:24.901Z] OT3 at org.junit.runners.ParentRunner.access$000(ParentRunner.java:58)
[2025-07-15T22:51:24.901Z] OT3 at org.junit.runners.ParentRunner$2.evaluate(ParentRunner.java:268)
[2025-07-15T22:51:24.901Z] OT3 at org.junit.runners.ParentRunner.run(ParentRunner.java:363)
[2025-07-15T22:51:24.901Z] OT3 at org.junit.runner.JUnitCore.run(JUnitCore.java:137)
[2025-07-15T22:51:24.901Z] OT3 at org.junit.runner.JUnitCore.run(JUnitCore.java:115)
[2025-07-15T22:51:24.901Z] OT3 at org.junit.runner.JUnitCore.runMain(JUnitCore.java:77)
[2025-07-15T22:51:24.901Z] OT3 at org.junit.runner.JUnitCore.main(JUnitCore.java:36)
[2025-07-15T22:51:24.901Z] OT3
[2025-07-15T22:51:24.901Z] OT3 FAILURES!!!
[2025-07-15T22:51:24.901Z] OT3 Tests run: 1, Failures: 1
[2025-07-15T22:51:24.901Z] OT3
[2025-07-15T22:51:24.901Z] STF 22:51:24.320 - Monitoring Report Summary:
[2025-07-15T22:51:24.901Z] STF 22:51:24.320 - o Process OT3 ended with the expected exit code (1)
[2025-07-15T22:51:24.901Z] STF 22:51:24.320 -
[2025-07-15T22:51:24.901Z] STF 22:51:24.320 - +------ Step 5 - Check output
[2025-07-15T22:51:24.901Z] STF 22:51:24.320 - | Count file matches
[2025-07-15T22:51:24.901Z] STF 22:51:24.320 - | TargetFile: /home/jenkins/workspace/Test_openjdk17_hs_sanity.system_arm_linux_testList_1/aqa-tests/TKG/output_17526194277625/PatMod_Unex_2/20250715-225111-PatModTest/results/4.OT3.stdout
[2025-07-15T22:51:24.901Z] STF 22:51:24.320 - | ExpectedNumMatches: 1
[2025-07-15T22:51:24.901Z] STF 22:51:24.320 - | SearchStrings: ["java.lang.IllegalAccessException"]
[2025-07-15T22:51:24.901Z] STF 22:51:24.320 - |
[2025-07-15T22:51:24.901Z] STF 22:51:24.320 - Found 1 instances of ["java.lang.IllegalAccessException"]
[2025-07-15T22:51:24.901Z] STF 22:51:24.320 -
[2025-07-15T22:51:24.901Z] STF 22:51:24.320 - +------ Step 6 - Include a new package that is not exported and check if the public type can be accessed by adding --add-exports
[2025-07-15T22:51:24.901Z] STF 22:51:24.320 - | Run foreground process
[2025-07-15T22:51:24.901Z] STF 22:51:24.320 - | Program: /home/jenkins/workspace/Test_openjdk17_hs_sanity.system_arm_linux_testList_1/jdkbinary/j2sdk-image/bin/java
[2025-07-15T22:51:24.901Z] STF 22:51:24.320 - | Mnemonic: OT4
[2025-07-15T22:51:24.901Z] STF 22:51:24.320 - | Echo: ECHO_ON
[2025-07-15T22:51:24.901Z] STF 22:51:24.320 - | Expectation: CLEAN_RUN within 1m
[2025-07-15T22:51:24.901Z] STF 22:51:24.320 - |
[2025-07-15T22:51:24.901Z] STF 22:51:24.321 - Running command: /home/jenkins/workspace/Test_openjdk17_hs_sanity.system_arm_linux_testList_1/jdkbinary/j2sdk-image/bin/java --add-reads com.test=ALL-UNNAMED --module-path /home/jenkins/workspace/Test_openjdk17_hs_sanity.system_arm_linux_testList_1/jvmtest/system/aqa-systemtest/openjdk.test.modularity/bin/common-mods:/home/jenkins/workspace/Test_openjdk17_hs_sanity.system_arm_linux_testList_1/jvmtest/system/aqa-systemtest/openjdk.test.modularity/bin/tests --add-modules=com.test --add-exports com.hello/adoptopenjdk.test.modularity.hellonew=com.test --patch-module com.hello=/home/jenkins/workspace/Test_openjdk17_hs_sanity.system_arm_linux_testList_1/aqa-tests/TKG/output_17526194277625/PatMod_Unex_2/20250715-225111-PatModTest/modules/1.com.hello.jar -classpath /home/jenkins/testDependency/system_lib/junit/junit.jar:/home/jenkins/testDependency/system_lib/junit/hamcrest-core.jar org.junit.runner.JUnitCore net.adoptopenjdk.test.modularity.junit.TestOverrideUsingAppModuleAndNewPackage
[2025-07-15T22:51:24.901Z] STF 22:51:24.321 - Redirecting stderr to /home/jenkins/workspace/Test_openjdk17_hs_sanity.system_arm_linux_testList_1/aqa-tests/TKG/output_17526194277625/PatMod_Unex_2/20250715-225111-PatModTest/results/6.OT4.stderr
[2025-07-15T22:51:24.901Z] STF 22:51:24.321 - Redirecting stdout to /home/jenkins/workspace/Test_openjdk17_hs_sanity.system_arm_linux_testList_1/aqa-tests/TKG/output_17526194277625/PatMod_Unex_2/20250715-225111-PatModTest/results/6.OT4.stdout
[2025-07-15T22:51:24.901Z] STF 22:51:24.322 - Monitoring processes: OT4
[2025-07-15T22:51:25.641Z] OT4 stderr WARNING: module-info.class ignored in patch: /home/jenkins/workspace/Test_openjdk17_hs_sanity.system_arm_linux_testList_1/aqa-tests/TKG/output_17526194277625/PatMod_Unex_2/20250715-225111-PatModTest/modules/1.com.hello.jar
[2025-07-15T22:51:25.641Z] OT4 JUnit version 4.12
[2025-07-15T22:51:26.385Z] OT4 .
[2025-07-15T22:51:26.385Z] OT4 Time: 0.005
[2025-07-15T22:51:26.385Z] OT4
[2025-07-15T22:51:26.385Z] OT4 OK (1 test)
[2025-07-15T22:51:26.385Z] OT4
[2025-07-15T22:51:26.385Z] STF 22:51:26.139 - Monitoring Report Summary:
[2025-07-15T22:51:26.385Z] STF 22:51:26.139 - o Process OT4 ended with the expected exit code (0)
[2025-07-15T22:51:26.385Z] STF 22:51:26.140 - EXECUTE stage completed
[2025-07-15T22:51:26.385Z] STF 22:51:26.195 -
[2025-07-15T22:51:26.385Z] STF 22:51:26.195 - ==================== T E A R D O W N ====================
[2025-07-15T22:51:26.385Z] STF 22:51:26.195 - Running teardown: perl /home/jenkins/workspace/Test_openjdk17_hs_sanity.system_arm_linux_testList_1/aqa-tests/TKG/../TKG/output_17526194277625/PatMod_Unex_2/20250715-225111-PatModTest/tearDown.pl
[2025-07-15T22:51:27.125Z] STF 22:51:26.377 - TEARDOWN stage completed
[2025-07-15T22:51:27.125Z] STF 22:51:26.381 -
[2025-07-15T22:51:27.125Z] STF 22:51:26.381 - ===================== R E S U L T S =====================
[2025-07-15T22:51:27.125Z] STF 22:51:26.381 - Stage results:
[2025-07-15T22:51:27.125Z] STF 22:51:26.381 - setUp: pass
[2025-07-15T22:51:27.125Z] STF 22:51:26.381 - execute: pass
[2025-07-15T22:51:27.125Z] STF 22:51:26.382 - teardown: pass
[2025-07-15T22:51:27.125Z] STF 22:51:26.382 -
[2025-07-15T22:51:27.125Z] STF 22:51:26.382 - Overall result: PASSED
[2025-07-15T22:51:27.125Z] -----------------------------------
[2025-07-15T22:51:27.125Z] PatMod_Unex_2_PASSED
[2025-07-15T22:51:27.125Z] -----------------------------------
[2025-07-15T22:51:27.125Z]
[2025-07-15T22:51:27.125Z] TEST TEARDOWN:
[2025-07-15T22:51:27.125Z] Nothing to be done for teardown.
[2025-07-15T22:51:27.125Z] PatMod_Unex_2 Finish Time: Tue Jul 15 22:51:26 2025 Epoch Time (ms): 1752619886422