Post Test
[2025-07-02T14:35:09.609Z] gmake[5]: Leaving directory '/home/jenkins/workspace/Test_openjdk17_hs_extended.perf_ppc64_aix_testList_1/aqa-tests/perf/renaissance'
[2025-07-02T14:35:09.609Z] gmake[4]: Leaving directory '/home/jenkins/workspace/Test_openjdk17_hs_extended.perf_ppc64_aix_testList_1/aqa-tests/perf'
[2025-07-02T14:35:09.609Z] gmake[3]: Leaving directory '/home/jenkins/workspace/Test_openjdk17_hs_extended.perf_ppc64_aix_testList_1/aqa-tests'
[2025-07-02T14:35:09.609Z]
[2025-07-02T14:35:09.609Z]
[2025-07-02T14:35:09.609Z] All tests finished, run result summary:
[2025-07-02T14:35:09.609Z] cd "/home/jenkins/workspace/Test_openjdk17_hs_extended.perf_ppc64_aix_testList_1/aqa-tests/TKG/../TKG/scripts"; \
[2025-07-02T14:35:09.609Z] perl "resultsSum.pl" --failuremk="/home/jenkins/workspace/Test_openjdk17_hs_extended.perf_ppc64_aix_testList_1/aqa-tests/TKG/../TKG/failedtargets.mk" --resultFile="/home/jenkins/workspace/Test_openjdk17_hs_extended.perf_ppc64_aix_testList_1/aqa-tests/TKG/../TKG/output_17514649883512/TestTargetResult" --platFile="/home/jenkins/workspace/Test_openjdk17_hs_extended.perf_ppc64_aix_testList_1/aqa-tests/TKG/../TKG/resources/buildPlatformMap.properties" --diagnostic=failure --jdkVersion=17 --jdkImpl=hotspot --jdkVendor="eclipse" --spec=aix_ppc-64 --buildList=perf --customTarget="" --testTarget=testList --tapPath=/home/jenkins/workspace/Test_openjdk17_hs_extended.perf_ppc64_aix_testList_1/aqa-tests/TKG/../TKG/output_17514649883512/ --tapName=Test_openjdk17_hs_extended.perf_ppc64_aix_testList_1.tap --comment=""
[2025-07-02T14:35:09.609Z]
[2025-07-02T14:35:09.609Z]
[2025-07-02T14:35:09.609Z] TEST TARGETS SUMMARY
[2025-07-02T14:35:09.609Z] ++++++++++++++++++++++++++++++++++++++++++++++++++++++++++++++++++++++++++
[2025-07-02T14:35:09.609Z] DISABLED test targets:
[2025-07-02T14:35:09.609Z] dacapo-tomcat_0
[2025-07-02T14:35:09.609Z] renaissance-finagle-chirper_0
[2025-07-02T14:35:09.609Z]
[2025-07-02T14:35:09.609Z] PASSED test targets:
[2025-07-02T14:35:09.609Z] dacapo-avrora_0
[2025-07-02T14:35:09.609Z] dacapo-fop_0
[2025-07-02T14:35:09.609Z] dacapo-jython_0
[2025-07-02T14:35:09.609Z] dacapo-luindex_0
[2025-07-02T14:35:09.609Z] dacapo-pmd_0
[2025-07-02T14:35:09.609Z] dacapo-sunflow_0
[2025-07-02T14:35:09.609Z] dacapo-xalan_0
[2025-07-02T14:35:09.609Z] renaissance-als_0
[2025-07-02T14:35:09.609Z] renaissance-chi-square_0
[2025-07-02T14:35:09.609Z] renaissance-dec-tree_0
[2025-07-02T14:35:09.609Z] renaissance-finagle-http_0
[2025-07-02T14:35:09.609Z] renaissance-log-regression_0
[2025-07-02T14:35:09.609Z] renaissance-mnemonics_0
[2025-07-02T14:35:09.609Z] renaissance-movie-lens_0
[2025-07-02T14:35:09.609Z] renaissance-par-mnemonics_0
[2025-07-02T14:35:09.609Z]
[2025-07-02T14:35:09.609Z] FAILED test targets:
[2025-07-02T14:35:09.609Z] renaissance-philosophers_0
[2025-07-02T14:35:09.609Z]
[2025-07-02T14:35:09.609Z] TOTAL: 19 EXECUTED: 16 PASSED: 15 FAILED: 1 DISABLED: 2 SKIPPED: 1
[2025-07-02T14:35:09.609Z] ++++++++++++++++++++++++++++++++++++++++++++++++++++++++++++++++++++++++++
[2025-07-02T14:35:09.609Z]
[2025-07-02T14:35:09.609Z] gmake[2]: *** [settings.mk:454: resultsSummary] Error 2
[2025-07-02T14:35:09.609Z] gmake[2]: Leaving directory '/home/jenkins/workspace/Test_openjdk17_hs_extended.perf_ppc64_aix_testList_1/aqa-tests/TKG'
[2025-07-02T14:35:09.609Z] gmake[1]: *** [makefile:62: _testList] Error 2
[2025-07-02T14:35:09.609Z] gmake[1]: Leaving directory '/home/jenkins/workspace/Test_openjdk17_hs_extended.perf_ppc64_aix_testList_1/aqa-tests/TKG'
[2025-07-02T14:35:09.609Z] gmake: *** [parallelList.mk:11: testList_1] Error 2
[2025-07-02T14:35:09.961Z] script returned exit code 2
[Pipeline] sh
[2025-07-02T14:35:11.873Z] + uname
[2025-07-02T14:35:11.873Z] + [ AIX = AIX ]
[2025-07-02T14:35:11.873Z] + MAKE=gmake
[2025-07-02T14:35:11.873Z] + gmake -f ./aqa-tests/TKG/testEnv.mk testEnvTeardown
[2025-07-02T14:35:11.873Z] gmake: Nothing to be done for 'testEnvTeardown'.
[Pipeline] }
[2025-07-02T14:35:12.307Z] $ ssh-agent -k
[2025-07-02T14:35:12.316Z] unset SSH_AUTH_SOCK;
[2025-07-02T14:35:12.316Z] unset SSH_AGENT_PID;
[2025-07-02T14:35:12.316Z] echo Agent pid 58786224 killed;
[2025-07-02T14:35:13.102Z] [ssh-agent] Stopped.
[Pipeline] // sshagent
[Pipeline] echo
[2025-07-02T14:35:13.154Z] no DaCapo-h2 metric found
[Pipeline] echo
[2025-07-02T14:35:13.218Z] There were test failures, set build result to UNSTABLE.
[Pipeline] }
[Pipeline] // stage
[Pipeline] stage
[Pipeline] { (Post)
[Pipeline] step
[2025-07-02T14:35:13.474Z] TAP Reports Processing: START
[2025-07-02T14:35:13.475Z] Looking for TAP results report in workspace using pattern: aqa-tests/TKG/**/*.tap
[2025-07-02T14:35:13.656Z] Saving reports...
[2025-07-02T14:35:13.835Z] Processing '/home/jenkins/.jenkins/jobs/Test_openjdk17_hs_extended.perf_ppc64_aix_testList_1/builds/2/tap-master-files/aqa-tests/TKG/output_17514649883512/Test_openjdk17_hs_extended.perf_ppc64_aix_testList_1.tap'
[2025-07-02T14:35:13.835Z] Parsing TAP test result [/home/jenkins/.jenkins/jobs/Test_openjdk17_hs_extended.perf_ppc64_aix_testList_1/builds/2/tap-master-files/aqa-tests/TKG/output_17514649883512/Test_openjdk17_hs_extended.perf_ppc64_aix_testList_1.tap].
[2025-07-02T14:35:13.839Z] There are failed test cases. Marking build as UNSTABLE
[2025-07-02T14:35:13.839Z] TAP Reports Processing: FINISH
[Pipeline] echo
[2025-07-02T14:35:13.846Z] Saving aqa-tests/testenv/testenv.properties file on jenkins.
[Pipeline] archiveArtifacts
[2025-07-02T14:35:14.028Z] Archiving artifacts
[2025-07-02T14:35:14.380Z] Recording fingerprints
[Pipeline] echo
[2025-07-02T14:35:14.588Z] Saving aqa-tests/TKG/**/*.tap file on jenkins.
[Pipeline] archiveArtifacts
[2025-07-02T14:35:14.769Z] Archiving artifacts
[2025-07-02T14:35:15.128Z] Recording fingerprints
[Pipeline] sh
[2025-07-02T14:35:17.200Z] + tar -cf benchmark_test_output.tar.gz ./aqa-tests/TKG/output_17514649883512
[Pipeline] echo
[2025-07-02T14:35:17.552Z] ARTIFACTORY_SERVER is not set. Saving artifacts on jenkins.
[Pipeline] archiveArtifacts
[2025-07-02T14:35:17.737Z] Archiving artifacts
[2025-07-02T14:35:18.090Z] Recording fingerprints
[Pipeline] findFiles
[Pipeline] echo
[2025-07-02T14:35:19.765Z] Tap file found: aqa-tests/TKG/output_17514649883512/Test_openjdk17_hs_extended.perf_ppc64_aix_testList_1.tap...
[Pipeline] readFile
[Pipeline] echo
[2025-07-02T14:35:20.012Z] Rerun in Grinder with failed test targets: https://ci.adoptium.net/job/Grinder/parambuild/?SDK_RESOURCE=upstream&TARGET=testList+TESTLIST=renaissance-philosophers_0&BASE_DOCKER_REGISTRY_CREDENTIAL_ID=&TEST_FLAG=&UPSTREAM_TEST_JOB_NAME=Test_openjdk17_hs_extended.perf_ppc64_aix&DOCKER_REQUIRED=false&ACTIVE_NODE_TIMEOUT=5&VENDOR_TEST_DIRS=&EXTRA_DOCKER_ARGS=&TKG_OWNER_BRANCH=adoptium%3Amaster&OPENJ9_SYSTEMTEST_OWNER_BRANCH=eclipse%3Amaster&PLATFORM=ppc64_aix&GENERATE_JOBS=true&KEEP_REPORTDIR=false&PERSONAL_BUILD=false&DOCKER_REGISTRY_DIR=&RERUN_ITERATIONS=0&ADOPTOPENJDK_REPO=https%3A%2F%2Fgithub.com%2Fadoptium%2Faqa-tests.git&SETUP_JCK_RUN=false&DOCKER_REGISTRY_URL_CREDENTIAL_ID=&LABEL=&EXTRA_OPTIONS=&CUSTOMIZED_SDK_URL=&BUILD_IDENTIFIER=&JENKINS_KEY=&ADOPTOPENJDK_BRANCH=master&LIGHT_WEIGHT_CHECKOUT=false&USE_JRE=false&ARTIFACTORY_SERVER=&KEEP_WORKSPACE=false&USER_CREDENTIALS_ID=&JDK_VERSION=17&DOCKER_REGISTRY_URL=&ITERATIONS=1&VENDOR_TEST_REPOS=&JDK_REPO=https%3A%2F%2Fgithub.com%2Fadoptium%2Fjdk17u&JCK_GIT_BRANCH=master&OPENJ9_BRANCH=master&OPENJ9_SHA=&JCK_GIT_REPO=&VENDOR_TEST_BRANCHES=&UPSTREAM_JOB_NAME=build-scripts%2Fjobs%2Fjdk17u%2Fjdk17u-aix-ppc64-temurin&OPENJ9_REPO=https%3A%2F%2Fgithub.com%2Feclipse-openj9%2Fopenj9.git&CLOUD_PROVIDER=&CUSTOM_TARGET=&VENDOR_TEST_SHAS=&JDK_BRANCH=dev&LABEL_ADDITION=sw.os.aix.7_2&ARTIFACTORY_REPO=&ARTIFACTORY_ROOT_DIR=&UPSTREAM_TEST_JOB_NUMBER=186&DOCKERIMAGE_TAG=&TEST_TIME=&JDK_IMPL=hotspot&SSH_AGENT_CREDENTIAL=&AUTO_DETECT=true&SLACK_CHANNEL=aqavit-bot&DYNAMIC_COMPILE=false&RELATED_NODES=&ADOPTOPENJDK_SYSTEMTEST_OWNER_BRANCH=adoptium%3Amaster&APPLICATION_OPTIONS=&CUSTOMIZED_SDK_URL_CREDENTIAL_ID=eclipse_temurin_bot_email_and_token&ARCHIVE_TEST_RESULTS=false&NUM_MACHINES=&OPENJDK_SHA=&TRSS_URL=&RERUN_FAILURE=false&USE_TESTENV_PROPERTIES=false&BUILD_LIST=perf&ADDITIONAL_ARTIFACTS_REQUIRED=&UPSTREAM_JOB_NUMBER=429&STF_OWNER_BRANCH=adoptium%3Amaster&TIME_LIMIT=25&JVM_OPTIONS=&PARALLEL=None
[Pipeline] junit
[2025-07-02T14:35:20.200Z] Recording test results
[2025-07-02T14:35:21.177Z] None of the test reports contained any result
[2025-07-02T14:35:21.177Z] [Checks API] No suitable checks publisher found.
[Pipeline] }
[Pipeline] // stage
[Pipeline] echo
[2025-07-02T14:35:21.214Z] PROCESSCATCH: Terminating any hung/left over test processes:
[Pipeline] sh
[2025-07-02T14:35:21.067Z] No test report files were found. Configuration error?
[2025-07-02T14:35:23.096Z] + aqa-tests/terminateTestProcesses.sh jenkins
[2025-07-02T14:35:23.096Z] + 2>& 1
[2025-07-02T14:35:23.096Z] Unix type machine..
[2025-07-02T14:35:23.096Z] Woohoo - no rogue processes detected!
Click here to forcibly terminate running steps
[Pipeline] cleanWs
[2025-07-02T14:35:23.799Z] [WS-CLEANUP] Deleting project workspace...
[2025-07-02T14:35:23.799Z] [WS-CLEANUP] Deferred wipeout is disabled by the job configuration...
[2025-07-02T14:35:27.000Z] [WS-CLEANUP] done
[Pipeline] sh
[2025-07-02T14:35:28.915Z] + find /tmp -name *core* -print -exec rm -f {} ;
[2025-07-02T14:35:28.915Z] + 2> /dev/null
[2025-07-02T14:35:28.915Z] + true
[Pipeline] }
[Pipeline] // timeout
[Pipeline] timeout
[2025-07-02T14:35:29.303Z] Timeout set to expire in 5 min 0 sec
[Pipeline] {
[Pipeline] }
[Pipeline] // timeout
[Pipeline] }
[Pipeline] // node
[Pipeline] }
[Pipeline] // stage
[Pipeline] echo
[2025-07-02T14:35:29.474Z] SETUP_LABEL: ci.role.test
[Pipeline] }
[Pipeline] // timestamps
[Pipeline] End of Pipeline
Finished: ABORTED