hotspot_runtime_0
[2025-06-19T22:42:34.714Z] Running test hotspot_runtime_0 ...
[2025-06-19T22:42:34.714Z] ===============================================
[2025-06-19T22:42:35.038Z] hotspot_runtime_0 Start Time: Thu Jun 19 22:42:34 2025 Epoch Time (ms): 1750372954773
[2025-06-19T22:42:35.038Z] variation: NoOptions
[2025-06-19T22:42:35.038Z] JVM_OPTIONS:
[2025-06-19T22:42:35.365Z] { \
[2025-06-19T22:42:35.365Z] echo ""; echo "TEST SETUP:"; \
[2025-06-19T22:42:35.365Z] echo "Nothing to be done for setup."; \
[2025-06-19T22:42:35.365Z] mkdir -p "C:/jenkins/workspace/Test_openjdk11_hs_extended.openjdk_x86-32_windows_testList_1/aqa-tests/\\TKG\\output_1750365128106\\hotspot_runtime_0"; \
[2025-06-19T22:42:35.365Z] cd "C:/jenkins/workspace/Test_openjdk11_hs_extended.openjdk_x86-32_windows_testList_1/aqa-tests/\\TKG\\output_1750365128106\\hotspot_runtime_0"; \
[2025-06-19T22:42:35.365Z] echo ""; echo "TESTING:"; \
[2025-06-19T22:42:35.365Z] "c:/jenkins/workspace/Test_openjdk11_hs_extended.openjdk_x86-32_windows_testList_1/jdkbinary/j2sdk-image\\bin\\java" -Xmx512m -jar "C:/jenkins/workspace/Test_openjdk11_hs_extended.openjdk_x86-32_windows_testList_1/aqa-tests///..//jvmtest\\openjdk\\jtreg\\lib\\jtreg.jar" \
[2025-06-19T22:42:35.365Z] -agentvm -a -ea -esa -v:fail,error,time,nopass -retain:fail,error,*.dmp,javacore.*,heapdump.*,*.trc -ignore:quiet -timeoutFactor:8 -xml:verify -concurrency:2 -nativepath:"c:\jenkins\workspace\Test_openjdk11_hs_extended.openjdk_x86-32_windows_testList_1/jdkbinary/openjdk-test-image\\hotspot\\jtreg\\native" -vmoptions:"-Xmx512m " \
[2025-06-19T22:42:35.365Z] -w ""C:/jenkins/workspace/Test_openjdk11_hs_extended.openjdk_x86-32_windows_testList_1/aqa-tests/\\TKG\\output_1750365128106\\hotspot_runtime_0"\\work" \
[2025-06-19T22:42:35.365Z] -r ""C:/jenkins/workspace/Test_openjdk11_hs_extended.openjdk_x86-32_windows_testList_1/aqa-tests/\\TKG\\output_1750365128106\\hotspot_runtime_0"\\report" \
[2025-06-19T22:42:35.365Z] -jdk:"c:/jenkins/workspace/Test_openjdk11_hs_extended.openjdk_x86-32_windows_testList_1/jdkbinary/j2sdk-image" \
[2025-06-19T22:42:35.365Z] -exclude:"C:/jenkins/workspace/Test_openjdk11_hs_extended.openjdk_x86-32_windows_testList_1/aqa-tests/\\openjdk\\openjdk-jdk\\test\\hotspot\\jtreg\\ProblemList.txt" \
[2025-06-19T22:42:35.365Z] -exclude:"C:/jenkins/workspace/Test_openjdk11_hs_extended.openjdk_x86-32_windows_testList_1/aqa-tests///..//jvmtest\\openjdk\\excludes/ProblemList_openjdk11.txt" \
[2025-06-19T22:42:35.365Z] \
[2025-06-19T22:42:35.365Z] -exclude:"C:/jenkins/workspace/Test_openjdk11_hs_extended.openjdk_x86-32_windows_testList_1/aqa-tests/\\openjdk\\excludes\\vendors\\eclipse\\ProblemList_openjdk11.txt" \
[2025-06-19T22:42:35.366Z] "C:/jenkins/workspace/Test_openjdk11_hs_extended.openjdk_x86-32_windows_testList_1/aqa-tests/\\openjdk\\openjdk-jdk\\test\\hotspot\\jtreg:hotspot_runtime"; \
[2025-06-19T22:42:35.366Z] if [ $? -eq 0 ]; then echo "-----------------------------------"; echo "hotspot_runtime_0""_PASSED"; echo "-----------------------------------"; cd C:/jenkins/workspace/Test_openjdk11_hs_extended.openjdk_x86-32_windows_testList_1/aqa-tests/; else echo "-----------------------------------"; echo "hotspot_runtime_0""_FAILED"; echo "-----------------------------------"; fi; \
[2025-06-19T22:42:35.366Z] echo ""; echo "TEST TEARDOWN:"; \
[2025-06-19T22:42:35.366Z] echo "Nothing to be done for teardown."; \
[2025-06-19T22:42:35.366Z] } 2>&1 | tee -a "C:/jenkins/workspace/Test_openjdk11_hs_extended.openjdk_x86-32_windows_testList_1/aqa-tests/\\TKG\\output_1750365128106\\TestTargetResult";
[2025-06-19T22:42:35.366Z]
[2025-06-19T22:42:35.366Z] TEST SETUP:
[2025-06-19T22:42:35.366Z] Nothing to be done for setup.
[2025-06-19T22:42:35.366Z]
[2025-06-19T22:42:35.366Z] TESTING:
[2025-06-19T22:42:36.055Z] Directory "C:\jenkins\workspace\Test_openjdk11_hs_extended.openjdk_x86-32_windows_testList_1\aqa-tests\TKG\output_1750365128106\hotspot_runtime_0\work" not found: creating
[2025-06-19T22:42:36.055Z] Directory "C:\jenkins\workspace\Test_openjdk11_hs_extended.openjdk_x86-32_windows_testList_1\aqa-tests\TKG\output_1750365128106\hotspot_runtime_0\report" not found: creating
[2025-06-19T22:42:38.931Z] XML output with verification to C:\jenkins\workspace\Test_openjdk11_hs_extended.openjdk_x86-32_windows_testList_1\aqa-tests\TKG\output_1750365128106\hotspot_runtime_0\work
[2025-06-19T22:44:02.582Z] --------------------------------------------------
[2025-06-19T22:44:02.582Z] TEST: runtime/appcds/jvmti/ClassFileLoadHookTest.java
[2025-06-19T22:44:02.582Z] TEST JDK: c:\jenkins\workspace\Test_openjdk11_hs_extended.openjdk_x86-32_windows_testList_1\jdkbinary\j2sdk-image
[2025-06-19T22:44:02.582Z]
[2025-06-19T22:44:02.582Z] ACTION: build -- Passed. Build successful
[2025-06-19T22:44:02.582Z] REASON: User specified action: run build ClassFileLoadHook
[2025-06-19T22:44:02.582Z] TIME: 0.08 seconds
[2025-06-19T22:44:02.582Z] messages:
[2025-06-19T22:44:02.582Z] command: build ClassFileLoadHook
[2025-06-19T22:44:02.582Z] reason: User specified action: run build ClassFileLoadHook
[2025-06-19T22:44:02.582Z] started: Thu Jun 19 22:43:47 GMT 2025
[2025-06-19T22:44:02.582Z] Test directory:
[2025-06-19T22:44:02.582Z] compile: ClassFileLoadHook
[2025-06-19T22:44:02.582Z] finished: Thu Jun 19 22:43:47 GMT 2025
[2025-06-19T22:44:02.582Z] elapsed time (seconds): 0.08
[2025-06-19T22:44:02.582Z]
[2025-06-19T22:44:02.582Z] ACTION: compile -- Passed. Compilation successful
[2025-06-19T22:44:02.582Z] REASON: .class file out of date or does not exist
[2025-06-19T22:44:02.582Z] TIME: 0.078 seconds
[2025-06-19T22:44:02.582Z] messages:
[2025-06-19T22:44:02.582Z] command: compile C:\jenkins\workspace\Test_openjdk11_hs_extended.openjdk_x86-32_windows_testList_1\aqa-tests\openjdk\openjdk-jdk\test\hotspot\jtreg\runtime\appcds\jvmti\ClassFileLoadHook.java
[2025-06-19T22:44:02.582Z] reason: .class file out of date or does not exist
[2025-06-19T22:44:02.582Z] started: Thu Jun 19 22:43:47 GMT 2025
[2025-06-19T22:44:02.582Z] Mode: agentvm
[2025-06-19T22:44:02.582Z] Agent id: 1
[2025-06-19T22:44:02.582Z] finished: Thu Jun 19 22:43:47 GMT 2025
[2025-06-19T22:44:02.582Z] elapsed time (seconds): 0.078
[2025-06-19T22:44:02.582Z] configuration:
[2025-06-19T22:44:02.582Z] Boot Layer (javac runtime environment)
[2025-06-19T22:44:02.582Z] class path: C:\jenkins\workspace\Test_openjdk11_hs_extended.openjdk_x86-32_windows_testList_1\jvmtest\openjdk\jtreg\lib\javatest.jar
[2025-06-19T22:44:02.582Z] C:\jenkins\workspace\Test_openjdk11_hs_extended.openjdk_x86-32_windows_testList_1\jvmtest\openjdk\jtreg\lib\jtreg.jar
[2025-06-19T22:44:02.582Z] patch: java.base C:\jenkins\workspace\Test_openjdk11_hs_extended.openjdk_x86-32_windows_testList_1\aqa-tests\TKG\output_1750365128106\hotspot_runtime_0\work\patches\java.base
[2025-06-19T22:44:02.582Z]
[2025-06-19T22:44:02.582Z] javac compilation environment
[2025-06-19T22:44:02.583Z] source path: C:\jenkins\workspace\Test_openjdk11_hs_extended.openjdk_x86-32_windows_testList_1\aqa-tests\openjdk\openjdk-jdk\test\hotspot\jtreg\runtime\appcds\jvmti
[2025-06-19T22:44:02.583Z] C:\jenkins\workspace\Test_openjdk11_hs_extended.openjdk_x86-32_windows_testList_1\aqa-tests\openjdk\openjdk-jdk\test\lib
[2025-06-19T22:44:02.583Z] C:\jenkins\workspace\Test_openjdk11_hs_extended.openjdk_x86-32_windows_testList_1\aqa-tests\openjdk\openjdk-jdk\test\hotspot\jtreg\runtime\appcds
[2025-06-19T22:44:02.583Z] class path: C:\jenkins\workspace\Test_openjdk11_hs_extended.openjdk_x86-32_windows_testList_1\aqa-tests\openjdk\openjdk-jdk\test\hotspot\jtreg\runtime\appcds\jvmti
[2025-06-19T22:44:02.583Z] C:\jenkins\workspace\Test_openjdk11_hs_extended.openjdk_x86-32_windows_testList_1\aqa-tests\TKG\output_1750365128106\hotspot_runtime_0\work\classes\1\runtime\appcds\jvmti\ClassFileLoadHookTest.d
[2025-06-19T22:44:02.583Z] C:\jenkins\workspace\Test_openjdk11_hs_extended.openjdk_x86-32_windows_testList_1\aqa-tests\TKG\output_1750365128106\hotspot_runtime_0\work\classes\1\test\lib
[2025-06-19T22:44:02.583Z] C:\jenkins\workspace\Test_openjdk11_hs_extended.openjdk_x86-32_windows_testList_1\aqa-tests\TKG\output_1750365128106\hotspot_runtime_0\work\classes\1\test\hotspot\jtreg\runtime\appcds
[2025-06-19T22:44:02.583Z]
[2025-06-19T22:44:02.583Z] rerun:
[2025-06-19T22:44:02.583Z] cd 'C:\jenkins\workspace\Test_openjdk11_hs_extended.openjdk_x86-32_windows_testList_1\aqa-tests\TKG\output_1750365128106\hotspot_runtime_0\work\scratch\0' && \
[2025-06-19T22:44:02.583Z] PATH='C:\Program Files\Java\jdk-17.0.13+11\bin;C:\cygwin64\bin;C:\Windows\system32;C:\Windows;C:\Windows\System32\Wbem;C:\Windows\System32\WindowsPowerShell\v1.0;C:\Windows\System32\OpenSSH;C:\Program Files\dotnet;C:\Users\adoptopenjdk\AppData\Local\Microsoft\WindowsApps;C:\Strawberry\perl\bin;C:\Program Files\Git\cmd;C:\openjdk\jdk-8\bin;C:\apache-ant\apache-ant-1.10.15\bin;C:\Program Files (x86)\IncrediBuild;C:\Program Files (x86)\Windows Kits\10\Windows Performance Toolkit;C:\rust\bin;C:\Program Files\IcedTeaWEB\bin;C:\Users\jenkins\AppData\Local\Microsoft\WindowsApps' \
[2025-06-19T22:44:02.583Z] SystemDrive=C: \
[2025-06-19T22:44:02.583Z] SystemRoot='C:\Windows' \
[2025-06-19T22:44:02.583Z] TEMP='C:\Users\jenkins\AppData\Local\Temp\2' \
[2025-06-19T22:44:02.583Z] TMP='C:\Users\jenkins\AppData\Local\Temp\2' \
[2025-06-19T22:44:02.583Z] windir='C:\Windows' \
[2025-06-19T22:44:02.583Z] 'c:\jenkins\workspace\Test_openjdk11_hs_extended.openjdk_x86-32_windows_testList_1\jdkbinary\j2sdk-image\bin\javac' \
[2025-06-19T22:44:02.583Z] -J-ea \
[2025-06-19T22:44:02.583Z] -J-esa \
[2025-06-19T22:44:02.583Z] -J-Xmx512m \
[2025-06-19T22:44:02.583Z] -J-Dtest.vm.opts='-ea -esa -Xmx512m' \
[2025-06-19T22:44:02.583Z] -J-Dtest.tool.vm.opts='-J-ea -J-esa -J-Xmx512m' \
[2025-06-19T22:44:02.583Z] -J-Dtest.compiler.opts= \
[2025-06-19T22:44:02.583Z] -J-Dtest.java.opts= \
[2025-06-19T22:44:02.583Z] -J-Dtest.jdk='c:\jenkins\workspace\Test_openjdk11_hs_extended.openjdk_x86-32_windows_testList_1\jdkbinary\j2sdk-image' \
[2025-06-19T22:44:02.583Z] -J-Dcompile.jdk='c:\jenkins\workspace\Test_openjdk11_hs_extended.openjdk_x86-32_windows_testList_1\jdkbinary\j2sdk-image' \
[2025-06-19T22:44:02.583Z] -J-Dtest.timeout.factor=8.0 \
[2025-06-19T22:44:02.583Z] -J-Dtest.nativepath='c:\jenkins\workspace\Test_openjdk11_hs_extended.openjdk_x86-32_windows_testList_1\jdkbinary\openjdk-test-image\hotspot\jtreg\native' \
[2025-06-19T22:44:02.583Z] -J-Dtest.root='C:\jenkins\workspace\Test_openjdk11_hs_extended.openjdk_x86-32_windows_testList_1\aqa-tests\openjdk\openjdk-jdk\test\hotspot\jtreg' \
[2025-06-19T22:44:02.583Z] -J-Dtest.name=runtime/appcds/jvmti/ClassFileLoadHookTest.java \
[2025-06-19T22:44:02.583Z] -J-Dtest.file='C:\jenkins\workspace\Test_openjdk11_hs_extended.openjdk_x86-32_windows_testList_1\aqa-tests\openjdk\openjdk-jdk\test\hotspot\jtreg\runtime\appcds\jvmti\ClassFileLoadHookTest.java' \
[2025-06-19T22:44:02.583Z] -J-Dtest.src='C:\jenkins\workspace\Test_openjdk11_hs_extended.openjdk_x86-32_windows_testList_1\aqa-tests\openjdk\openjdk-jdk\test\hotspot\jtreg\runtime\appcds\jvmti' \
[2025-06-19T22:44:02.583Z] -J-Dtest.src.path='C:\jenkins\workspace\Test_openjdk11_hs_extended.openjdk_x86-32_windows_testList_1\aqa-tests\openjdk\openjdk-jdk\test\hotspot\jtreg\runtime\appcds\jvmti;C:\jenkins\workspace\Test_openjdk11_hs_extended.openjdk_x86-32_windows_testList_1\aqa-tests\openjdk\openjdk-jdk\test\lib;C:\jenkins\workspace\Test_openjdk11_hs_extended.openjdk_x86-32_windows_testList_1\aqa-tests\openjdk\openjdk-jdk\test\hotspot\jtreg\runtime\appcds' \
[2025-06-19T22:44:02.583Z] -J-Dtest.classes='C:\jenkins\workspace\Test_openjdk11_hs_extended.openjdk_x86-32_windows_testList_1\aqa-tests\TKG\output_1750365128106\hotspot_runtime_0\work\classes\1\runtime\appcds\jvmti\ClassFileLoadHookTest.d' \
[2025-06-19T22:44:02.583Z] -J-Dtest.class.path='C:\jenkins\workspace\Test_openjdk11_hs_extended.openjdk_x86-32_windows_testList_1\aqa-tests\TKG\output_1750365128106\hotspot_runtime_0\work\classes\1\runtime\appcds\jvmti\ClassFileLoadHookTest.d;C:\jenkins\workspace\Test_openjdk11_hs_extended.openjdk_x86-32_windows_testList_1\aqa-tests\TKG\output_1750365128106\hotspot_runtime_0\work\classes\1\test\lib;C:\jenkins\workspace\Test_openjdk11_hs_extended.openjdk_x86-32_windows_testList_1\aqa-tests\TKG\output_1750365128106\hotspot_runtime_0\work\classes\1\test\hotspot\jtreg\runtime\appcds' \
[2025-06-19T22:44:02.583Z] -J-Dtest.class.path.prefix='C:\jenkins\workspace\Test_openjdk11_hs_extended.openjdk_x86-32_windows_testList_1\aqa-tests\TKG\output_1750365128106\hotspot_runtime_0\work\classes\1\runtime\appcds\jvmti\ClassFileLoadHookTest.d;C:\jenkins\workspace\Test_openjdk11_hs_extended.openjdk_x86-32_windows_testList_1\aqa-tests\openjdk\openjdk-jdk\test\hotspot\jtreg\runtime\appcds\jvmti;C:\jenkins\workspace\Test_openjdk11_hs_extended.openjdk_x86-32_windows_testList_1\aqa-tests\TKG\output_1750365128106\hotspot_runtime_0\work\classes\1\test\lib;C:\jenkins\workspace\Test_openjdk11_hs_extended.openjdk_x86-32_windows_testList_1\aqa-tests\TKG\output_1750365128106\hotspot_runtime_0\work\classes\1\test\hotspot\jtreg\runtime\appcds' \
[2025-06-19T22:44:02.583Z] -d 'C:\jenkins\workspace\Test_openjdk11_hs_extended.openjdk_x86-32_windows_testList_1\aqa-tests\TKG\output_1750365128106\hotspot_runtime_0\work\classes\1\runtime\appcds\jvmti\ClassFileLoadHookTest.d' \
[2025-06-19T22:44:02.583Z] -sourcepath 'C:\jenkins\workspace\Test_openjdk11_hs_extended.openjdk_x86-32_windows_testList_1\aqa-tests\openjdk\openjdk-jdk\test\hotspot\jtreg\runtime\appcds\jvmti;C:\jenkins\workspace\Test_openjdk11_hs_extended.openjdk_x86-32_windows_testList_1\aqa-tests\openjdk\openjdk-jdk\test\lib;C:\jenkins\workspace\Test_openjdk11_hs_extended.openjdk_x86-32_windows_testList_1\aqa-tests\openjdk\openjdk-jdk\test\hotspot\jtreg\runtime\appcds' \
[2025-06-19T22:44:02.583Z] -classpath 'C:\jenkins\workspace\Test_openjdk11_hs_extended.openjdk_x86-32_windows_testList_1\aqa-tests\openjdk\openjdk-jdk\test\hotspot\jtreg\runtime\appcds\jvmti;C:\jenkins\workspace\Test_openjdk11_hs_extended.openjdk_x86-32_windows_testList_1\aqa-tests\TKG\output_1750365128106\hotspot_runtime_0\work\classes\1\runtime\appcds\jvmti\ClassFileLoadHookTest.d;C:\jenkins\workspace\Test_openjdk11_hs_extended.openjdk_x86-32_windows_testList_1\aqa-tests\TKG\output_1750365128106\hotspot_runtime_0\work\classes\1\test\lib;C:\jenkins\workspace\Test_openjdk11_hs_extended.openjdk_x86-32_windows_testList_1\aqa-tests\TKG\output_1750365128106\hotspot_runtime_0\work\classes\1\test\hotspot\jtreg\runtime\appcds' 'C:\jenkins\workspace\Test_openjdk11_hs_extended.openjdk_x86-32_windows_testList_1\aqa-tests\openjdk\openjdk-jdk\test\hotspot\jtreg\runtime\appcds\jvmti\ClassFileLoadHook.java'
[2025-06-19T22:44:02.583Z]
[2025-06-19T22:44:02.583Z] ACTION: build -- Passed. Build successful
[2025-06-19T22:44:02.583Z] REASON: Named class compiled on demand
[2025-06-19T22:44:02.583Z] TIME: 0.412 seconds
[2025-06-19T22:44:02.583Z] messages:
[2025-06-19T22:44:02.583Z] command: build ClassFileLoadHookTest
[2025-06-19T22:44:02.583Z] reason: Named class compiled on demand
[2025-06-19T22:44:02.583Z] started: Thu Jun 19 22:43:47 GMT 2025
[2025-06-19T22:44:02.583Z] Test directory:
[2025-06-19T22:44:02.583Z] compile: ClassFileLoadHookTest
[2025-06-19T22:44:02.583Z] finished: Thu Jun 19 22:43:47 GMT 2025
[2025-06-19T22:44:02.583Z] elapsed time (seconds): 0.412
[2025-06-19T22:44:02.583Z]
[2025-06-19T22:44:02.583Z] ACTION: compile -- Passed. Compilation successful
[2025-06-19T22:44:02.583Z] REASON: .class file out of date or does not exist
[2025-06-19T22:44:02.583Z] TIME: 0.41 seconds
[2025-06-19T22:44:02.583Z] messages:
[2025-06-19T22:44:02.583Z] command: compile C:\jenkins\workspace\Test_openjdk11_hs_extended.openjdk_x86-32_windows_testList_1\aqa-tests\openjdk\openjdk-jdk\test\hotspot\jtreg\runtime\appcds\jvmti\ClassFileLoadHookTest.java
[2025-06-19T22:44:02.583Z] reason: .class file out of date or does not exist
[2025-06-19T22:44:02.583Z] started: Thu Jun 19 22:43:47 GMT 2025
[2025-06-19T22:44:02.583Z] Mode: agentvm
[2025-06-19T22:44:02.583Z] Agent id: 1
[2025-06-19T22:44:02.583Z] finished: Thu Jun 19 22:43:47 GMT 2025
[2025-06-19T22:44:02.583Z] elapsed time (seconds): 0.41
[2025-06-19T22:44:02.583Z] configuration:
[2025-06-19T22:44:02.583Z] Boot Layer (javac runtime environment)
[2025-06-19T22:44:02.583Z] class path: C:\jenkins\workspace\Test_openjdk11_hs_extended.openjdk_x86-32_windows_testList_1\jvmtest\openjdk\jtreg\lib\javatest.jar
[2025-06-19T22:44:02.583Z] C:\jenkins\workspace\Test_openjdk11_hs_extended.openjdk_x86-32_windows_testList_1\jvmtest\openjdk\jtreg\lib\jtreg.jar
[2025-06-19T22:44:02.583Z] patch: java.base C:\jenkins\workspace\Test_openjdk11_hs_extended.openjdk_x86-32_windows_testList_1\aqa-tests\TKG\output_1750365128106\hotspot_runtime_0\work\patches\java.base
[2025-06-19T22:44:02.583Z]
[2025-06-19T22:44:02.583Z] javac compilation environment
[2025-06-19T22:44:02.583Z] source path: C:\jenkins\workspace\Test_openjdk11_hs_extended.openjdk_x86-32_windows_testList_1\aqa-tests\openjdk\openjdk-jdk\test\hotspot\jtreg\runtime\appcds\jvmti
[2025-06-19T22:44:02.583Z] C:\jenkins\workspace\Test_openjdk11_hs_extended.openjdk_x86-32_windows_testList_1\aqa-tests\openjdk\openjdk-jdk\test\lib
[2025-06-19T22:44:02.583Z] C:\jenkins\workspace\Test_openjdk11_hs_extended.openjdk_x86-32_windows_testList_1\aqa-tests\openjdk\openjdk-jdk\test\hotspot\jtreg\runtime\appcds
[2025-06-19T22:44:02.583Z] class path: C:\jenkins\workspace\Test_openjdk11_hs_extended.openjdk_x86-32_windows_testList_1\aqa-tests\openjdk\openjdk-jdk\test\hotspot\jtreg\runtime\appcds\jvmti
[2025-06-19T22:44:02.583Z] C:\jenkins\workspace\Test_openjdk11_hs_extended.openjdk_x86-32_windows_testList_1\aqa-tests\TKG\output_1750365128106\hotspot_runtime_0\work\classes\1\runtime\appcds\jvmti\ClassFileLoadHookTest.d
[2025-06-19T22:44:02.583Z] C:\jenkins\workspace\Test_openjdk11_hs_extended.openjdk_x86-32_windows_testList_1\aqa-tests\TKG\output_1750365128106\hotspot_runtime_0\work\classes\1\test\lib
[2025-06-19T22:44:02.583Z] C:\jenkins\workspace\Test_openjdk11_hs_extended.openjdk_x86-32_windows_testList_1\aqa-tests\TKG\output_1750365128106\hotspot_runtime_0\work\classes\1\test\hotspot\jtreg\runtime\appcds
[2025-06-19T22:44:02.583Z]
[2025-06-19T22:44:02.583Z] rerun:
[2025-06-19T22:44:02.584Z] cd 'C:\jenkins\workspace\Test_openjdk11_hs_extended.openjdk_x86-32_windows_testList_1\aqa-tests\TKG\output_1750365128106\hotspot_runtime_0\work\scratch\0' && \
[2025-06-19T22:44:02.584Z] PATH='C:\Program Files\Java\jdk-17.0.13+11\bin;C:\cygwin64\bin;C:\Windows\system32;C:\Windows;C:\Windows\System32\Wbem;C:\Windows\System32\WindowsPowerShell\v1.0;C:\Windows\System32\OpenSSH;C:\Program Files\dotnet;C:\Users\adoptopenjdk\AppData\Local\Microsoft\WindowsApps;C:\Strawberry\perl\bin;C:\Program Files\Git\cmd;C:\openjdk\jdk-8\bin;C:\apache-ant\apache-ant-1.10.15\bin;C:\Program Files (x86)\IncrediBuild;C:\Program Files (x86)\Windows Kits\10\Windows Performance Toolkit;C:\rust\bin;C:\Program Files\IcedTeaWEB\bin;C:\Users\jenkins\AppData\Local\Microsoft\WindowsApps' \
[2025-06-19T22:44:02.584Z] SystemDrive=C: \
[2025-06-19T22:44:02.584Z] SystemRoot='C:\Windows' \
[2025-06-19T22:44:02.584Z] TEMP='C:\Users\jenkins\AppData\Local\Temp\2' \
[2025-06-19T22:44:02.584Z] TMP='C:\Users\jenkins\AppData\Local\Temp\2' \
[2025-06-19T22:44:02.584Z] windir='C:\Windows' \
[2025-06-19T22:44:02.584Z] 'c:\jenkins\workspace\Test_openjdk11_hs_extended.openjdk_x86-32_windows_testList_1\jdkbinary\j2sdk-image\bin\javac' \
[2025-06-19T22:44:02.584Z] -J-ea \
[2025-06-19T22:44:02.584Z] -J-esa \
[2025-06-19T22:44:02.584Z] -J-Xmx512m \
[2025-06-19T22:44:02.584Z] -J-Dtest.vm.opts='-ea -esa -Xmx512m' \
[2025-06-19T22:44:02.584Z] -J-Dtest.tool.vm.opts='-J-ea -J-esa -J-Xmx512m' \
[2025-06-19T22:44:02.584Z] -J-Dtest.compiler.opts= \
[2025-06-19T22:44:02.584Z] -J-Dtest.java.opts= \
[2025-06-19T22:44:02.584Z] -J-Dtest.jdk='c:\jenkins\workspace\Test_openjdk11_hs_extended.openjdk_x86-32_windows_testList_1\jdkbinary\j2sdk-image' \
[2025-06-19T22:44:02.584Z] -J-Dcompile.jdk='c:\jenkins\workspace\Test_openjdk11_hs_extended.openjdk_x86-32_windows_testList_1\jdkbinary\j2sdk-image' \
[2025-06-19T22:44:02.584Z] -J-Dtest.timeout.factor=8.0 \
[2025-06-19T22:44:02.584Z] -J-Dtest.nativepath='c:\jenkins\workspace\Test_openjdk11_hs_extended.openjdk_x86-32_windows_testList_1\jdkbinary\openjdk-test-image\hotspot\jtreg\native' \
[2025-06-19T22:44:02.584Z] -J-Dtest.root='C:\jenkins\workspace\Test_openjdk11_hs_extended.openjdk_x86-32_windows_testList_1\aqa-tests\openjdk\openjdk-jdk\test\hotspot\jtreg' \
[2025-06-19T22:44:02.584Z] -J-Dtest.name=runtime/appcds/jvmti/ClassFileLoadHookTest.java \
[2025-06-19T22:44:02.584Z] -J-Dtest.file='C:\jenkins\workspace\Test_openjdk11_hs_extended.openjdk_x86-32_windows_testList_1\aqa-tests\openjdk\openjdk-jdk\test\hotspot\jtreg\runtime\appcds\jvmti\ClassFileLoadHookTest.java' \
[2025-06-19T22:44:02.584Z] -J-Dtest.src='C:\jenkins\workspace\Test_openjdk11_hs_extended.openjdk_x86-32_windows_testList_1\aqa-tests\openjdk\openjdk-jdk\test\hotspot\jtreg\runtime\appcds\jvmti' \
[2025-06-19T22:44:02.584Z] -J-Dtest.src.path='C:\jenkins\workspace\Test_openjdk11_hs_extended.openjdk_x86-32_windows_testList_1\aqa-tests\openjdk\openjdk-jdk\test\hotspot\jtreg\runtime\appcds\jvmti;C:\jenkins\workspace\Test_openjdk11_hs_extended.openjdk_x86-32_windows_testList_1\aqa-tests\openjdk\openjdk-jdk\test\lib;C:\jenkins\workspace\Test_openjdk11_hs_extended.openjdk_x86-32_windows_testList_1\aqa-tests\openjdk\openjdk-jdk\test\hotspot\jtreg\runtime\appcds' \
[2025-06-19T22:44:02.584Z] -J-Dtest.classes='C:\jenkins\workspace\Test_openjdk11_hs_extended.openjdk_x86-32_windows_testList_1\aqa-tests\TKG\output_1750365128106\hotspot_runtime_0\work\classes\1\runtime\appcds\jvmti\ClassFileLoadHookTest.d' \
[2025-06-19T22:44:02.584Z] -J-Dtest.class.path='C:\jenkins\workspace\Test_openjdk11_hs_extended.openjdk_x86-32_windows_testList_1\aqa-tests\TKG\output_1750365128106\hotspot_runtime_0\work\classes\1\runtime\appcds\jvmti\ClassFileLoadHookTest.d;C:\jenkins\workspace\Test_openjdk11_hs_extended.openjdk_x86-32_windows_testList_1\aqa-tests\TKG\output_1750365128106\hotspot_runtime_0\work\classes\1\test\lib;C:\jenkins\workspace\Test_openjdk11_hs_extended.openjdk_x86-32_windows_testList_1\aqa-tests\TKG\output_1750365128106\hotspot_runtime_0\work\classes\1\test\hotspot\jtreg\runtime\appcds' \
[2025-06-19T22:44:02.584Z] -J-Dtest.class.path.prefix='C:\jenkins\workspace\Test_openjdk11_hs_extended.openjdk_x86-32_windows_testList_1\aqa-tests\TKG\output_1750365128106\hotspot_runtime_0\work\classes\1\runtime\appcds\jvmti\ClassFileLoadHookTest.d;C:\jenkins\workspace\Test_openjdk11_hs_extended.openjdk_x86-32_windows_testList_1\aqa-tests\openjdk\openjdk-jdk\test\hotspot\jtreg\runtime\appcds\jvmti;C:\jenkins\workspace\Test_openjdk11_hs_extended.openjdk_x86-32_windows_testList_1\aqa-tests\TKG\output_1750365128106\hotspot_runtime_0\work\classes\1\test\lib;C:\jenkins\workspace\Test_openjdk11_hs_extended.openjdk_x86-32_windows_testList_1\aqa-tests\TKG\output_1750365128106\hotspot_runtime_0\work\classes\1\test\hotspot\jtreg\runtime\appcds' \
[2025-06-19T22:44:02.584Z] -d 'C:\jenkins\workspace\Test_openjdk11_hs_extended.openjdk_x86-32_windows_testList_1\aqa-tests\TKG\output_1750365128106\hotspot_runtime_0\work\classes\1\runtime\appcds\jvmti\ClassFileLoadHookTest.d' \
[2025-06-19T22:44:02.584Z] -sourcepath 'C:\jenkins\workspace\Test_openjdk11_hs_extended.openjdk_x86-32_windows_testList_1\aqa-tests\openjdk\openjdk-jdk\test\hotspot\jtreg\runtime\appcds\jvmti;C:\jenkins\workspace\Test_openjdk11_hs_extended.openjdk_x86-32_windows_testList_1\aqa-tests\openjdk\openjdk-jdk\test\lib;C:\jenkins\workspace\Test_openjdk11_hs_extended.openjdk_x86-32_windows_testList_1\aqa-tests\openjdk\openjdk-jdk\test\hotspot\jtreg\runtime\appcds' \
[2025-06-19T22:44:02.584Z] -classpath 'C:\jenkins\workspace\Test_openjdk11_hs_extended.openjdk_x86-32_windows_testList_1\aqa-tests\openjdk\openjdk-jdk\test\hotspot\jtreg\runtime\appcds\jvmti;C:\jenkins\workspace\Test_openjdk11_hs_extended.openjdk_x86-32_windows_testList_1\aqa-tests\TKG\output_1750365128106\hotspot_runtime_0\work\classes\1\runtime\appcds\jvmti\ClassFileLoadHookTest.d;C:\jenkins\workspace\Test_openjdk11_hs_extended.openjdk_x86-32_windows_testList_1\aqa-tests\TKG\output_1750365128106\hotspot_runtime_0\work\classes\1\test\lib;C:\jenkins\workspace\Test_openjdk11_hs_extended.openjdk_x86-32_windows_testList_1\aqa-tests\TKG\output_1750365128106\hotspot_runtime_0\work\classes\1\test\hotspot\jtreg\runtime\appcds' 'C:\jenkins\workspace\Test_openjdk11_hs_extended.openjdk_x86-32_windows_testList_1\aqa-tests\openjdk\openjdk-jdk\test\hotspot\jtreg\runtime\appcds\jvmti\ClassFileLoadHookTest.java'
[2025-06-19T22:44:02.584Z]
[2025-06-19T22:44:02.584Z] ACTION: main -- Failed. Execution failed: `main' threw exception: java.lang.RuntimeException: Expected to get exit value of [0]
[2025-06-19T22:44:02.584Z] REASON: User specified action: run main/othervm/native ClassFileLoadHookTest
[2025-06-19T22:44:02.584Z] TIME: 3.331 seconds
[2025-06-19T22:44:02.584Z] messages:
[2025-06-19T22:44:02.584Z] command: main ClassFileLoadHookTest
[2025-06-19T22:44:02.584Z] reason: User specified action: run main/othervm/native ClassFileLoadHookTest
[2025-06-19T22:44:02.584Z] started: Thu Jun 19 22:43:47 GMT 2025
[2025-06-19T22:44:02.584Z] Mode: othervm [/othervm specified]
[2025-06-19T22:44:02.584Z] finished: Thu Jun 19 22:43:51 GMT 2025
[2025-06-19T22:44:02.584Z] elapsed time (seconds): 3.331
[2025-06-19T22:44:02.584Z] configuration:
[2025-06-19T22:44:02.584Z] STDOUT:
[2025-06-19T22:44:02.584Z] Command line: [c:\jenkins\workspace\Test_openjdk11_hs_extended.openjdk_x86-32_windows_testList_1\jdkbinary\j2sdk-image\bin\java.exe -cp C:\jenkins\workspace\Test_openjdk11_hs_extended.openjdk_x86-32_windows_testList_1\aqa-tests\TKG\output_1750365128106\hotspot_runtime_0\work\classes\1\runtime\appcds\jvmti\ClassFileLoadHookTest.d;C:\jenkins\workspace\Test_openjdk11_hs_extended.openjdk_x86-32_windows_testList_1\aqa-tests\openjdk\openjdk-jdk\test\hotspot\jtreg\runtime\appcds\jvmti;C:\jenkins\workspace\Test_openjdk11_hs_extended.openjdk_x86-32_windows_testList_1\aqa-tests\TKG\output_1750365128106\hotspot_runtime_0\work\classes\1\test\lib;C:\jenkins\workspace\Test_openjdk11_hs_extended.openjdk_x86-32_windows_testList_1\aqa-tests\openjdk\openjdk-jdk\test\lib;C:\jenkins\workspace\Test_openjdk11_hs_extended.openjdk_x86-32_windows_testList_1\aqa-tests\TKG\output_1750365128106\hotspot_runtime_0\work\classes\1\test\hotspot\jtreg\runtime\appcds;C:\jenkins\workspace\Test_openjdk11_hs_extended.openjdk_x86-32_windows_testList_1\aqa-tests\openjdk\openjdk-jdk\test\hotspot\jtreg\runtime\appcds;C:\jenkins\workspace\Test_openjdk11_hs_extended.openjdk_x86-32_windows_testList_1\jvmtest\openjdk\jtreg\lib\javatest.jar;C:\jenkins\workspace\Test_openjdk11_hs_extended.openjdk_x86-32_windows_testList_1\jvmtest\openjdk\jtreg\lib\jtreg.jar -XX:+UnlockDiagnosticVMOptions -XX:+WhiteBoxAPI -Xbootclasspath/a:C:\jenkins\workspace\Test_openjdk11_hs_extended.openjdk_x86-32_windows_testList_1\aqa-tests\TKG\output_1750365128106\hotspot_runtime_0\work\scratch\0\WhiteBox.jar -agentlib:SimpleClassFileLoadHook=LoadMe,beforeHook,after_Hook ClassFileLoadHook SHARING_OFF_CFLH_ON ]
[2025-06-19T22:44:02.584Z] [2025-06-19T22:43:48.797477200Z] Gathering output for process 33848
[2025-06-19T22:44:02.584Z] [ELAPSED: 660 ms]
[2025-06-19T22:44:02.584Z] [logging stdout to runtime.appcds.jvmti.ClassFileLoadHookTest.java-0000-no-sharing.stdout]
[2025-06-19T22:44:02.584Z] [logging stderr to runtime.appcds.jvmti.ClassFileLoadHookTest.java-0000-no-sharing.stderr]
[2025-06-19T22:44:02.584Z] [STDERR]
[2025-06-19T22:44:02.584Z] Agent library loaded with options = LoadMe,beforeHook,after_Hook
[2025-06-19T22:44:02.584Z] CLASS_NAME = LoadMe, FROM = beforeHook, TO = after_Hook
[2025-06-19T22:44:02.584Z] found class to be hooked: LoadMe - rewriting ...
[2025-06-19T22:44:02.584Z] Rewriting done. Replaced 2 occurrence(s) of "beforeHook" to "after_Hook"
[2025-06-19T22:44:02.584Z]
[2025-06-19T22:44:02.584Z] [2025-06-19T22:43:49.436491900Z] Waiting for completion for process 33848
[2025-06-19T22:44:02.584Z] [2025-06-19T22:43:49.437491300Z] Waiting for completion finished for process 33848
[2025-06-19T22:44:02.585Z] Command line: [c:\jenkins\workspace\Test_openjdk11_hs_extended.openjdk_x86-32_windows_testList_1\jdkbinary\j2sdk-image\bin\java.exe -cp C:\jenkins\workspace\Test_openjdk11_hs_extended.openjdk_x86-32_windows_testList_1\aqa-tests\TKG\output_1750365128106\hotspot_runtime_0\work\classes\1\runtime\appcds\jvmti\ClassFileLoadHookTest.d;C:\jenkins\workspace\Test_openjdk11_hs_extended.openjdk_x86-32_windows_testList_1\aqa-tests\openjdk\openjdk-jdk\test\hotspot\jtreg\runtime\appcds\jvmti;C:\jenkins\workspace\Test_openjdk11_hs_extended.openjdk_x86-32_windows_testList_1\aqa-tests\TKG\output_1750365128106\hotspot_runtime_0\work\classes\1\test\lib;C:\jenkins\workspace\Test_openjdk11_hs_extended.openjdk_x86-32_windows_testList_1\aqa-tests\openjdk\openjdk-jdk\test\lib;C:\jenkins\workspace\Test_openjdk11_hs_extended.openjdk_x86-32_windows_testList_1\aqa-tests\TKG\output_1750365128106\hotspot_runtime_0\work\classes\1\test\hotspot\jtreg\runtime\appcds;C:\jenkins\workspace\Test_openjdk11_hs_extended.openjdk_x86-32_windows_testList_1\aqa-tests\openjdk\openjdk-jdk\test\hotspot\jtreg\runtime\appcds;C:\jenkins\workspace\Test_openjdk11_hs_extended.openjdk_x86-32_windows_testList_1\jvmtest\openjdk\jtreg\lib\javatest.jar;C:\jenkins\workspace\Test_openjdk11_hs_extended.openjdk_x86-32_windows_testList_1\jvmtest\openjdk\jtreg\lib\jtreg.jar -ea -esa -Xmx512m -cp C:\jenkins\workspace\Test_openjdk11_hs_extended.openjdk_x86-32_windows_testList_1\aqa-tests\TKG\output_1750365128106\hotspot_runtime_0\work\scratch\0\ClassFileLoadHook.jar -Xshare:dump -XX:ExtraSharedClassListFile=C:\jenkins\workspace\Test_openjdk11_hs_extended.openjdk_x86-32_windows_testList_1\aqa-tests\TKG\output_1750365128106\hotspot_runtime_0\work\classes\1\runtime\appcds\jvmti\ClassFileLoadHookTest.d\runtime.appcds.jvmti.ClassFileLoadHookTest.java-test.classlist -XX:SharedArchiveFile=C:\jenkins\workspace\Test_openjdk11_hs_extended.openjdk_x86-32_windows_testList_1\aqa-tests\TKG\output_1750365128106\hotspot_runtime_0\work\scratch\0\appcds-22h43m49s446.jsa -Xbootclasspath/a:C:\jenkins\workspace\Test_openjdk11_hs_extended.openjdk_x86-32_windows_testList_1\aqa-tests\TKG\output_1750365128106\hotspot_runtime_0\work\scratch\0\WhiteBox.jar ]
[2025-06-19T22:44:02.585Z] [2025-06-19T22:43:49.573495900Z] Gathering output for process 15856
[2025-06-19T22:44:02.585Z] [ELAPSED: 1245 ms]
[2025-06-19T22:44:02.585Z] [logging stdout to runtime.appcds.jvmti.ClassFileLoadHookTest.java-0001-dump.stdout]
[2025-06-19T22:44:02.585Z] [logging stderr to runtime.appcds.jvmti.ClassFileLoadHookTest.java-0001-dump.stderr]
[2025-06-19T22:44:02.585Z] [STDERR]
[2025-06-19T22:44:02.585Z]
[2025-06-19T22:44:02.585Z] [2025-06-19T22:43:50.818516700Z] Waiting for completion for process 15856
[2025-06-19T22:44:02.585Z] [2025-06-19T22:43:50.828518800Z] Waiting for completion finished for process 15856
[2025-06-19T22:44:02.585Z] Command line: [c:\jenkins\workspace\Test_openjdk11_hs_extended.openjdk_x86-32_windows_testList_1\jdkbinary\j2sdk-image\bin\java.exe -cp C:\jenkins\workspace\Test_openjdk11_hs_extended.openjdk_x86-32_windows_testList_1\aqa-tests\TKG\output_1750365128106\hotspot_runtime_0\work\classes\1\runtime\appcds\jvmti\ClassFileLoadHookTest.d;C:\jenkins\workspace\Test_openjdk11_hs_extended.openjdk_x86-32_windows_testList_1\aqa-tests\openjdk\openjdk-jdk\test\hotspot\jtreg\runtime\appcds\jvmti;C:\jenkins\workspace\Test_openjdk11_hs_extended.openjdk_x86-32_windows_testList_1\aqa-tests\TKG\output_1750365128106\hotspot_runtime_0\work\classes\1\test\lib;C:\jenkins\workspace\Test_openjdk11_hs_extended.openjdk_x86-32_windows_testList_1\aqa-tests\openjdk\openjdk-jdk\test\lib;C:\jenkins\workspace\Test_openjdk11_hs_extended.openjdk_x86-32_windows_testList_1\aqa-tests\TKG\output_1750365128106\hotspot_runtime_0\work\classes\1\test\hotspot\jtreg\runtime\appcds;C:\jenkins\workspace\Test_openjdk11_hs_extended.openjdk_x86-32_windows_testList_1\aqa-tests\openjdk\openjdk-jdk\test\hotspot\jtreg\runtime\appcds;C:\jenkins\workspace\Test_openjdk11_hs_extended.openjdk_x86-32_windows_testList_1\jvmtest\openjdk\jtreg\lib\javatest.jar;C:\jenkins\workspace\Test_openjdk11_hs_extended.openjdk_x86-32_windows_testList_1\jvmtest\openjdk\jtreg\lib\jtreg.jar -ea -esa -Xmx512m -Xshare:on -showversion -XX:SharedArchiveFile=C:\jenkins\workspace\Test_openjdk11_hs_extended.openjdk_x86-32_windows_testList_1\aqa-tests\TKG\output_1750365128106\hotspot_runtime_0\work\scratch\0\appcds-22h43m49s446.jsa -Dtest.timeout.factor=8.0 -cp C:\jenkins\workspace\Test_openjdk11_hs_extended.openjdk_x86-32_windows_testList_1\aqa-tests\TKG\output_1750365128106\hotspot_runtime_0\work\scratch\0\ClassFileLoadHook.jar -XX:+UnlockDiagnosticVMOptions -XX:+WhiteBoxAPI -Xbootclasspath/a:C:\jenkins\workspace\Test_openjdk11_hs_extended.openjdk_x86-32_windows_testList_1\aqa-tests\TKG\output_1750365128106\hotspot_runtime_0\work\scratch\0\WhiteBox.jar ClassFileLoadHook SHARING_ON_CFLH_OFF ]
[2025-06-19T22:44:02.585Z] [2025-06-19T22:43:50.841520Z] Gathering output for process 36084
[2025-06-19T22:44:02.585Z] [ELAPSED: 90 ms]
[2025-06-19T22:44:02.585Z] [logging stdout to runtime.appcds.jvmti.ClassFileLoadHookTest.java-0002-exec.stdout]
[2025-06-19T22:44:02.585Z] [logging stderr to runtime.appcds.jvmti.ClassFileLoadHookTest.java-0002-exec.stderr]
[2025-06-19T22:44:02.585Z] [STDERR]
[2025-06-19T22:44:02.585Z] An error has occurred while processing the shared archive file.
[2025-06-19T22:44:02.585Z] Unable to map MiscData shared space at required address.
[2025-06-19T22:44:02.585Z]
[2025-06-19T22:44:02.585Z] [2025-06-19T22:43:50.932520400Z] Waiting for completion for process 36084
[2025-06-19T22:44:02.585Z] [2025-06-19T22:43:50.933527300Z] Waiting for completion finished for process 36084
[2025-06-19T22:44:02.585Z] [2025-06-19T22:43:50.959522Z] Waiting for completion for process 36084
[2025-06-19T22:44:02.585Z] [2025-06-19T22:43:50.960522Z] Waiting for completion finished for process 36084
[2025-06-19T22:44:02.585Z] Unable to map shared archive: test did not complete; assumed PASS
[2025-06-19T22:44:02.585Z] Command line: [c:\jenkins\workspace\Test_openjdk11_hs_extended.openjdk_x86-32_windows_testList_1\jdkbinary\j2sdk-image\bin\java.exe -cp C:\jenkins\workspace\Test_openjdk11_hs_extended.openjdk_x86-32_windows_testList_1\aqa-tests\TKG\output_1750365128106\hotspot_runtime_0\work\classes\1\runtime\appcds\jvmti\ClassFileLoadHookTest.d;C:\jenkins\workspace\Test_openjdk11_hs_extended.openjdk_x86-32_windows_testList_1\aqa-tests\openjdk\openjdk-jdk\test\hotspot\jtreg\runtime\appcds\jvmti;C:\jenkins\workspace\Test_openjdk11_hs_extended.openjdk_x86-32_windows_testList_1\aqa-tests\TKG\output_1750365128106\hotspot_runtime_0\work\classes\1\test\lib;C:\jenkins\workspace\Test_openjdk11_hs_extended.openjdk_x86-32_windows_testList_1\aqa-tests\openjdk\openjdk-jdk\test\lib;C:\jenkins\workspace\Test_openjdk11_hs_extended.openjdk_x86-32_windows_testList_1\aqa-tests\TKG\output_1750365128106\hotspot_runtime_0\work\classes\1\test\hotspot\jtreg\runtime\appcds;C:\jenkins\workspace\Test_openjdk11_hs_extended.openjdk_x86-32_windows_testList_1\aqa-tests\openjdk\openjdk-jdk\test\hotspot\jtreg\runtime\appcds;C:\jenkins\workspace\Test_openjdk11_hs_extended.openjdk_x86-32_windows_testList_1\jvmtest\openjdk\jtreg\lib\javatest.jar;C:\jenkins\workspace\Test_openjdk11_hs_extended.openjdk_x86-32_windows_testList_1\jvmtest\openjdk\jtreg\lib\jtreg.jar -ea -esa -Xmx512m -Xshare:auto -showversion -XX:SharedArchiveFile=C:\jenkins\workspace\Test_openjdk11_hs_extended.openjdk_x86-32_windows_testList_1\aqa-tests\TKG\output_1750365128106\hotspot_runtime_0\work\scratch\0\appcds-22h43m49s446.jsa -Dtest.timeout.factor=8.0 -cp C:\jenkins\workspace\Test_openjdk11_hs_extended.openjdk_x86-32_windows_testList_1\aqa-tests\TKG\output_1750365128106\hotspot_runtime_0\work\scratch\0\ClassFileLoadHook.jar -XX:+UnlockDiagnosticVMOptions -XX:+WhiteBoxAPI -Xbootclasspath/a:C:\jenkins\workspace\Test_openjdk11_hs_extended.openjdk_x86-32_windows_testList_1\aqa-tests\TKG\output_1750365128106\hotspot_runtime_0\work\scratch\0\WhiteBox.jar -agentlib:SimpleClassFileLoadHook=LoadMe,beforeHook,after_Hook ClassFileLoadHook SHARING_AUTO_CFLH_ON ]
[2025-06-19T22:44:02.585Z] [2025-06-19T22:43:50.975522100Z] Gathering output for process 55988
[2025-06-19T22:44:02.585Z] [ELAPSED: 320 ms]
[2025-06-19T22:44:02.585Z] [logging stdout to runtime.appcds.jvmti.ClassFileLoadHookTest.java-0003-exec.stdout]
[2025-06-19T22:44:02.585Z] [logging stderr to runtime.appcds.jvmti.ClassFileLoadHookTest.java-0003-exec.stderr]
[2025-06-19T22:44:02.585Z] [STDERR]
[2025-06-19T22:44:02.585Z] Agent library loaded with options = LoadMe,beforeHook,after_Hook
[2025-06-19T22:44:02.585Z] CLASS_NAME = LoadMe, FROM = beforeHook, TO = after_Hook
[2025-06-19T22:44:02.585Z] openjdk version "11.0.28-beta" 2025-07-15
[2025-06-19T22:44:02.585Z] OpenJDK Runtime Environment Temurin-11.0.28+5-202506190027 (build 11.0.28-beta+5-ea)
[2025-06-19T22:44:02.585Z] OpenJDK Client VM Temurin-11.0.28+5-202506190027 (build 11.0.28-beta+5-ea, mixed mode)
[2025-06-19T22:44:02.585Z] found class to be hooked: LoadMe - rewriting ...
[2025-06-19T22:44:02.585Z] Rewriting done. Replaced 2 occurrence(s) of "beforeHook" to "after_Hook"
[2025-06-19T22:44:02.585Z] Exception in thread "main" java.lang.RuntimeException: must be shared
[2025-06-19T22:44:02.585Z] at ClassFileLoadHook.assertTrue(ClassFileLoadHook.java:106)
[2025-06-19T22:44:02.585Z] at ClassFileLoadHook.test2(ClassFileLoadHook.java:100)
[2025-06-19T22:44:02.585Z] at ClassFileLoadHook.main(ClassFileLoadHook.java:47)
[2025-06-19T22:44:02.585Z]
[2025-06-19T22:44:02.585Z] [2025-06-19T22:43:51.295528700Z] Waiting for completion for process 55988
[2025-06-19T22:44:02.585Z] [2025-06-19T22:43:51.299527700Z] Waiting for completion finished for process 55988
[2025-06-19T22:44:02.585Z] [2025-06-19T22:43:51.299527700Z] Waiting for completion for process 55988
[2025-06-19T22:44:02.585Z] [2025-06-19T22:43:51.299527700Z] Waiting for completion finished for process 55988
[2025-06-19T22:44:02.585Z] [2025-06-19T22:43:51.303528400Z] Waiting for completion for process 55988
[2025-06-19T22:44:02.585Z] [2025-06-19T22:43:51.303528400Z] Waiting for completion finished for process 55988
[2025-06-19T22:44:02.585Z] STDERR:
[2025-06-19T22:44:02.585Z] stdout: [Error occurred during initialization of VM
[2025-06-19T22:44:02.585Z] Unable to use shared archive.
[2025-06-19T22:44:02.585Z] ];
[2025-06-19T22:44:02.585Z] stderr: [An error has occurred while processing the shared archive file.
[2025-06-19T22:44:02.585Z] Unable to map MiscData shared space at required address.
[2025-06-19T22:44:02.585Z] ]
[2025-06-19T22:44:02.585Z] exitValue = 1
[2025-06-19T22:44:02.585Z]
[2025-06-19T22:44:02.585Z] stdout: [====== ClassFileLoadHook.main():testCase = SHARING_AUTO_CFLH_ON
[2025-06-19T22:44:02.585Z] getValue():after_Hook
[2025-06-19T22:44:02.585Z] getOtherValue():abc-after_Hook-xyz
[2025-06-19T22:44:02.585Z] ];
[2025-06-19T22:44:02.585Z] stderr: [Agent library loaded with options = LoadMe,beforeHook,after_Hook
[2025-06-19T22:44:02.585Z] CLASS_NAME = LoadMe, FROM = beforeHook, TO = after_Hook
[2025-06-19T22:44:02.585Z] openjdk version "11.0.28-beta" 2025-07-15
[2025-06-19T22:44:02.585Z] OpenJDK Runtime Environment Temurin-11.0.28+5-202506190027 (build 11.0.28-beta+5-ea)
[2025-06-19T22:44:02.585Z] OpenJDK Client VM Temurin-11.0.28+5-202506190027 (build 11.0.28-beta+5-ea, mixed mode)
[2025-06-19T22:44:02.585Z] found class to be hooked: LoadMe - rewriting ...
[2025-06-19T22:44:02.585Z] Rewriting done. Replaced 2 occurrence(s) of "beforeHook" to "after_Hook"
[2025-06-19T22:44:02.585Z] Exception in thread "main" java.lang.RuntimeException: must be shared
[2025-06-19T22:44:02.585Z] at ClassFileLoadHook.assertTrue(ClassFileLoadHook.java:106)
[2025-06-19T22:44:02.585Z] at ClassFileLoadHook.test2(ClassFileLoadHook.java:100)
[2025-06-19T22:44:02.585Z] at ClassFileLoadHook.main(ClassFileLoadHook.java:47)
[2025-06-19T22:44:02.585Z] ]
[2025-06-19T22:44:02.585Z] exitValue = 1
[2025-06-19T22:44:02.585Z]
[2025-06-19T22:44:02.585Z] java.lang.RuntimeException: Expected to get exit value of [0]
[2025-06-19T22:44:02.585Z]
[2025-06-19T22:44:02.585Z] at jdk.test.lib.process.OutputAnalyzer.shouldHaveExitValue(OutputAnalyzer.java:431)
[2025-06-19T22:44:02.585Z] at jdk.test.lib.cds.CDSTestUtils.checkExec(CDSTestUtils.java:451)
[2025-06-19T22:44:02.585Z] at ClassFileLoadHookTest.main(ClassFileLoadHookTest.java:87)
[2025-06-19T22:44:02.585Z] at java.base/jdk.internal.reflect.NativeMethodAccessorImpl.invoke0(Native Method)
[2025-06-19T22:44:02.585Z] at java.base/jdk.internal.reflect.NativeMethodAccessorImpl.invoke(NativeMethodAccessorImpl.java:62)
[2025-06-19T22:44:02.585Z] at java.base/jdk.internal.reflect.DelegatingMethodAccessorImpl.invoke(DelegatingMethodAccessorImpl.java:43)
[2025-06-19T22:44:02.585Z] at java.base/java.lang.reflect.Method.invoke(Method.java:566)
[2025-06-19T22:44:02.585Z] at com.sun.javatest.regtest.agent.MainWrapper$MainTask.run(MainWrapper.java:138)
[2025-06-19T22:44:02.585Z] at java.base/java.lang.Thread.run(Thread.java:829)
[2025-06-19T22:44:02.585Z]
[2025-06-19T22:44:02.585Z] JavaTest Message: Test threw exception: java.lang.RuntimeException: Expected to get exit value of [0]
[2025-06-19T22:44:02.585Z]
[2025-06-19T22:44:02.585Z] JavaTest Message: shutting down test
[2025-06-19T22:44:02.585Z]
[2025-06-19T22:44:02.585Z] STATUS:Failed.`main' threw exception: java.lang.RuntimeException: Expected to get exit value of [0]
[2025-06-19T22:44:02.585Z] rerun:
[2025-06-19T22:44:02.585Z] cd 'C:\jenkins\workspace\Test_openjdk11_hs_extended.openjdk_x86-32_windows_testList_1\aqa-tests\TKG\output_1750365128106\hotspot_runtime_0\work\scratch\0' && \
[2025-06-19T22:44:02.586Z] PATH='C:\Program Files\Java\jdk-17.0.13+11\bin;C:\cygwin64\bin;C:\Windows\system32;C:\Windows;C:\Windows\System32\Wbem;C:\Windows\System32\WindowsPowerShell\v1.0;C:\Windows\System32\OpenSSH;C:\Program Files\dotnet;C:\Users\adoptopenjdk\AppData\Local\Microsoft\WindowsApps;C:\Strawberry\perl\bin;C:\Program Files\Git\cmd;C:\openjdk\jdk-8\bin;C:\apache-ant\apache-ant-1.10.15\bin;C:\Program Files (x86)\IncrediBuild;C:\Program Files (x86)\Windows Kits\10\Windows Performance Toolkit;C:\rust\bin;C:\Program Files\IcedTeaWEB\bin;C:\Users\jenkins\AppData\Local\Microsoft\WindowsApps;c:\jenkins\workspace\Test_openjdk11_hs_extended.openjdk_x86-32_windows_testList_1\jdkbinary\openjdk-test-image\hotspot\jtreg\native' \
[2025-06-19T22:44:02.586Z] SystemDrive=C: \
[2025-06-19T22:44:02.586Z] SystemRoot='C:\Windows' \
[2025-06-19T22:44:02.586Z] TEMP='C:\Users\jenkins\AppData\Local\Temp\2' \
[2025-06-19T22:44:02.586Z] TMP='C:\Users\jenkins\AppData\Local\Temp\2' \
[2025-06-19T22:44:02.586Z] windir='C:\Windows' \
[2025-06-19T22:44:02.586Z] CLASSPATH='C:\jenkins\workspace\Test_openjdk11_hs_extended.openjdk_x86-32_windows_testList_1\aqa-tests\TKG\output_1750365128106\hotspot_runtime_0\work\classes\1\runtime\appcds\jvmti\ClassFileLoadHookTest.d;C:\jenkins\workspace\Test_openjdk11_hs_extended.openjdk_x86-32_windows_testList_1\aqa-tests\openjdk\openjdk-jdk\test\hotspot\jtreg\runtime\appcds\jvmti;C:\jenkins\workspace\Test_openjdk11_hs_extended.openjdk_x86-32_windows_testList_1\aqa-tests\TKG\output_1750365128106\hotspot_runtime_0\work\classes\1\test\lib;C:\jenkins\workspace\Test_openjdk11_hs_extended.openjdk_x86-32_windows_testList_1\aqa-tests\openjdk\openjdk-jdk\test\lib;C:\jenkins\workspace\Test_openjdk11_hs_extended.openjdk_x86-32_windows_testList_1\aqa-tests\TKG\output_1750365128106\hotspot_runtime_0\work\classes\1\test\hotspot\jtreg\runtime\appcds;C:\jenkins\workspace\Test_openjdk11_hs_extended.openjdk_x86-32_windows_testList_1\aqa-tests\openjdk\openjdk-jdk\test\hotspot\jtreg\runtime\appcds;C:\jenkins\workspace\Test_openjdk11_hs_extended.openjdk_x86-32_windows_testList_1\jvmtest\openjdk\jtreg\lib\javatest.jar;C:\jenkins\workspace\Test_openjdk11_hs_extended.openjdk_x86-32_windows_testList_1\jvmtest\openjdk\jtreg\lib\jtreg.jar' \
[2025-06-19T22:44:02.586Z] 'c:\jenkins\workspace\Test_openjdk11_hs_extended.openjdk_x86-32_windows_testList_1\jdkbinary\j2sdk-image\bin\java' \
[2025-06-19T22:44:02.586Z] -Dtest.vm.opts='-ea -esa -Xmx512m' \
[2025-06-19T22:44:02.586Z] -Dtest.tool.vm.opts='-J-ea -J-esa -J-Xmx512m' \
[2025-06-19T22:44:02.586Z] -Dtest.compiler.opts= \
[2025-06-19T22:44:02.586Z] -Dtest.java.opts= \
[2025-06-19T22:44:02.586Z] -Dtest.jdk='c:\jenkins\workspace\Test_openjdk11_hs_extended.openjdk_x86-32_windows_testList_1\jdkbinary\j2sdk-image' \
[2025-06-19T22:44:02.586Z] -Dcompile.jdk='c:\jenkins\workspace\Test_openjdk11_hs_extended.openjdk_x86-32_windows_testList_1\jdkbinary\j2sdk-image' \
[2025-06-19T22:44:02.586Z] -Dtest.timeout.factor=8.0 \
[2025-06-19T22:44:02.586Z] -Dtest.nativepath='c:\jenkins\workspace\Test_openjdk11_hs_extended.openjdk_x86-32_windows_testList_1\jdkbinary\openjdk-test-image\hotspot\jtreg\native' \
[2025-06-19T22:44:02.586Z] -Dtest.root='C:\jenkins\workspace\Test_openjdk11_hs_extended.openjdk_x86-32_windows_testList_1\aqa-tests\openjdk\openjdk-jdk\test\hotspot\jtreg' \
[2025-06-19T22:44:02.586Z] -Dtest.name=runtime/appcds/jvmti/ClassFileLoadHookTest.java \
[2025-06-19T22:44:02.586Z] -Dtest.file='C:\jenkins\workspace\Test_openjdk11_hs_extended.openjdk_x86-32_windows_testList_1\aqa-tests\openjdk\openjdk-jdk\test\hotspot\jtreg\runtime\appcds\jvmti\ClassFileLoadHookTest.java' \
[2025-06-19T22:44:02.586Z] -Dtest.src='C:\jenkins\workspace\Test_openjdk11_hs_extended.openjdk_x86-32_windows_testList_1\aqa-tests\openjdk\openjdk-jdk\test\hotspot\jtreg\runtime\appcds\jvmti' \
[2025-06-19T22:44:02.586Z] -Dtest.src.path='C:\jenkins\workspace\Test_openjdk11_hs_extended.openjdk_x86-32_windows_testList_1\aqa-tests\openjdk\openjdk-jdk\test\hotspot\jtreg\runtime\appcds\jvmti;C:\jenkins\workspace\Test_openjdk11_hs_extended.openjdk_x86-32_windows_testList_1\aqa-tests\openjdk\openjdk-jdk\test\lib;C:\jenkins\workspace\Test_openjdk11_hs_extended.openjdk_x86-32_windows_testList_1\aqa-tests\openjdk\openjdk-jdk\test\hotspot\jtreg\runtime\appcds' \
[2025-06-19T22:44:02.586Z] -Dtest.classes='C:\jenkins\workspace\Test_openjdk11_hs_extended.openjdk_x86-32_windows_testList_1\aqa-tests\TKG\output_1750365128106\hotspot_runtime_0\work\classes\1\runtime\appcds\jvmti\ClassFileLoadHookTest.d' \
[2025-06-19T22:44:02.586Z] -Dtest.class.path='C:\jenkins\workspace\Test_openjdk11_hs_extended.openjdk_x86-32_windows_testList_1\aqa-tests\TKG\output_1750365128106\hotspot_runtime_0\work\classes\1\runtime\appcds\jvmti\ClassFileLoadHookTest.d;C:\jenkins\workspace\Test_openjdk11_hs_extended.openjdk_x86-32_windows_testList_1\aqa-tests\TKG\output_1750365128106\hotspot_runtime_0\work\classes\1\test\lib;C:\jenkins\workspace\Test_openjdk11_hs_extended.openjdk_x86-32_windows_testList_1\aqa-tests\TKG\output_1750365128106\hotspot_runtime_0\work\classes\1\test\hotspot\jtreg\runtime\appcds' \
[2025-06-19T22:44:02.586Z] -Dtest.class.path.prefix='C:\jenkins\workspace\Test_openjdk11_hs_extended.openjdk_x86-32_windows_testList_1\aqa-tests\TKG\output_1750365128106\hotspot_runtime_0\work\classes\1\runtime\appcds\jvmti\ClassFileLoadHookTest.d;C:\jenkins\workspace\Test_openjdk11_hs_extended.openjdk_x86-32_windows_testList_1\aqa-tests\openjdk\openjdk-jdk\test\hotspot\jtreg\runtime\appcds\jvmti;C:\jenkins\workspace\Test_openjdk11_hs_extended.openjdk_x86-32_windows_testList_1\aqa-tests\TKG\output_1750365128106\hotspot_runtime_0\work\classes\1\test\lib;C:\jenkins\workspace\Test_openjdk11_hs_extended.openjdk_x86-32_windows_testList_1\aqa-tests\TKG\output_1750365128106\hotspot_runtime_0\work\classes\1\test\hotspot\jtreg\runtime\appcds' \
[2025-06-19T22:44:02.586Z] -ea \
[2025-06-19T22:44:02.586Z] -esa \
[2025-06-19T22:44:02.586Z] -Xmx512m \
[2025-06-19T22:44:02.586Z] '-Djava.library.path=c:\jenkins\workspace\Test_openjdk11_hs_extended.openjdk_x86-32_windows_testList_1\jdkbinary\openjdk-test-image\hotspot\jtreg\native' \
[2025-06-19T22:44:02.586Z] com.sun.javatest.regtest.agent.MainWrapper 'C:\jenkins\workspace\Test_openjdk11_hs_extended.openjdk_x86-32_windows_testList_1\aqa-tests\TKG\output_1750365128106\hotspot_runtime_0\work\runtime\appcds\jvmti\ClassFileLoadHookTest.d\main.0.jta'
[2025-06-19T22:44:02.586Z]
[2025-06-19T22:44:02.586Z] TEST RESULT: Failed. Execution failed: `main' threw exception: java.lang.RuntimeException: Expected to get exit value of [0]
[2025-06-19T22:44:02.586Z] --------------------------------------------------
[2025-06-19T22:49:27.996Z] TEST: runtime/handshake/HandshakeWalkExitTest.java
[2025-06-19T22:49:27.996Z] TEST JDK: c:\jenkins\workspace\Test_openjdk11_hs_extended.openjdk_x86-32_windows_testList_1\jdkbinary\j2sdk-image
[2025-06-19T22:49:27.996Z]
[2025-06-19T22:49:27.996Z] ACTION: build -- Passed. Build successful
[2025-06-19T22:49:27.996Z] REASON: User specified action: run build HandshakeWalkExitTest
[2025-06-19T22:49:27.996Z] TIME: 0.096 seconds
[2025-06-19T22:49:27.996Z] messages:
[2025-06-19T22:49:27.996Z] command: build HandshakeWalkExitTest
[2025-06-19T22:49:27.996Z] reason: User specified action: run build HandshakeWalkExitTest
[2025-06-19T22:49:27.996Z] started: Thu Jun 19 22:49:19 GMT 2025
[2025-06-19T22:49:27.996Z] Test directory:
[2025-06-19T22:49:27.996Z] compile: HandshakeWalkExitTest
[2025-06-19T22:49:27.996Z] finished: Thu Jun 19 22:49:19 GMT 2025
[2025-06-19T22:49:27.996Z] elapsed time (seconds): 0.096
[2025-06-19T22:49:27.996Z]
[2025-06-19T22:49:27.996Z] ACTION: compile -- Passed. Compilation successful
[2025-06-19T22:49:27.996Z] REASON: .class file out of date or does not exist
[2025-06-19T22:49:27.996Z] TIME: 0.094 seconds
[2025-06-19T22:49:27.996Z] messages:
[2025-06-19T22:49:27.996Z] command: compile C:\jenkins\workspace\Test_openjdk11_hs_extended.openjdk_x86-32_windows_testList_1\aqa-tests\openjdk\openjdk-jdk\test\hotspot\jtreg\runtime\handshake\HandshakeWalkExitTest.java
[2025-06-19T22:49:27.996Z] reason: .class file out of date or does not exist
[2025-06-19T22:49:27.996Z] started: Thu Jun 19 22:49:19 GMT 2025
[2025-06-19T22:49:27.996Z] Mode: agentvm
[2025-06-19T22:49:27.996Z] Agent id: 1
[2025-06-19T22:49:27.996Z] finished: Thu Jun 19 22:49:19 GMT 2025
[2025-06-19T22:49:27.996Z] elapsed time (seconds): 0.094
[2025-06-19T22:49:27.996Z] configuration:
[2025-06-19T22:49:27.996Z] Boot Layer (javac runtime environment)
[2025-06-19T22:49:27.996Z] class path: C:\jenkins\workspace\Test_openjdk11_hs_extended.openjdk_x86-32_windows_testList_1\jvmtest\openjdk\jtreg\lib\javatest.jar
[2025-06-19T22:49:27.996Z] C:\jenkins\workspace\Test_openjdk11_hs_extended.openjdk_x86-32_windows_testList_1\jvmtest\openjdk\jtreg\lib\jtreg.jar
[2025-06-19T22:49:27.996Z] patch: java.base C:\jenkins\workspace\Test_openjdk11_hs_extended.openjdk_x86-32_windows_testList_1\aqa-tests\TKG\output_1750365128106\hotspot_runtime_0\work\patches\java.base
[2025-06-19T22:49:27.996Z]
[2025-06-19T22:49:27.996Z] javac compilation environment
[2025-06-19T22:49:27.996Z] source path: C:\jenkins\workspace\Test_openjdk11_hs_extended.openjdk_x86-32_windows_testList_1\aqa-tests\openjdk\openjdk-jdk\test\hotspot\jtreg\runtime\handshake
[2025-06-19T22:49:27.996Z] C:\jenkins\workspace\Test_openjdk11_hs_extended.openjdk_x86-32_windows_testList_1\aqa-tests\openjdk\openjdk-jdk\test\hotspot\jtreg\testlibrary
[2025-06-19T22:49:27.996Z] C:\jenkins\workspace\Test_openjdk11_hs_extended.openjdk_x86-32_windows_testList_1\aqa-tests\openjdk\openjdk-jdk\test\lib
[2025-06-19T22:49:27.996Z] class path: C:\jenkins\workspace\Test_openjdk11_hs_extended.openjdk_x86-32_windows_testList_1\aqa-tests\openjdk\openjdk-jdk\test\hotspot\jtreg\runtime\handshake
[2025-06-19T22:49:27.996Z] C:\jenkins\workspace\Test_openjdk11_hs_extended.openjdk_x86-32_windows_testList_1\aqa-tests\TKG\output_1750365128106\hotspot_runtime_0\work\classes\1\runtime\handshake\HandshakeWalkExitTest.d
[2025-06-19T22:49:27.996Z] C:\jenkins\workspace\Test_openjdk11_hs_extended.openjdk_x86-32_windows_testList_1\aqa-tests\TKG\output_1750365128106\hotspot_runtime_0\work\classes\1\testlibrary
[2025-06-19T22:49:27.996Z] C:\jenkins\workspace\Test_openjdk11_hs_extended.openjdk_x86-32_windows_testList_1\aqa-tests\TKG\output_1750365128106\hotspot_runtime_0\work\classes\1\test\lib
[2025-06-19T22:49:27.996Z]
[2025-06-19T22:49:27.996Z] rerun:
[2025-06-19T22:49:27.996Z] cd 'C:\jenkins\workspace\Test_openjdk11_hs_extended.openjdk_x86-32_windows_testList_1\aqa-tests\TKG\output_1750365128106\hotspot_runtime_0\work\scratch\0' && \
[2025-06-19T22:49:27.996Z] PATH='C:\Program Files\Java\jdk-17.0.13+11\bin;C:\cygwin64\bin;C:\Windows\system32;C:\Windows;C:\Windows\System32\Wbem;C:\Windows\System32\WindowsPowerShell\v1.0;C:\Windows\System32\OpenSSH;C:\Program Files\dotnet;C:\Users\adoptopenjdk\AppData\Local\Microsoft\WindowsApps;C:\Strawberry\perl\bin;C:\Program Files\Git\cmd;C:\openjdk\jdk-8\bin;C:\apache-ant\apache-ant-1.10.15\bin;C:\Program Files (x86)\IncrediBuild;C:\Program Files (x86)\Windows Kits\10\Windows Performance Toolkit;C:\rust\bin;C:\Program Files\IcedTeaWEB\bin;C:\Users\jenkins\AppData\Local\Microsoft\WindowsApps' \
[2025-06-19T22:49:27.996Z] SystemDrive=C: \
[2025-06-19T22:49:27.996Z] SystemRoot='C:\Windows' \
[2025-06-19T22:49:27.996Z] TEMP='C:\Users\jenkins\AppData\Local\Temp\2' \
[2025-06-19T22:49:27.996Z] TMP='C:\Users\jenkins\AppData\Local\Temp\2' \
[2025-06-19T22:49:27.996Z] windir='C:\Windows' \
[2025-06-19T22:49:27.996Z] 'c:\jenkins\workspace\Test_openjdk11_hs_extended.openjdk_x86-32_windows_testList_1\jdkbinary\j2sdk-image\bin\javac' \
[2025-06-19T22:49:27.996Z] -J-ea \
[2025-06-19T22:49:27.996Z] -J-esa \
[2025-06-19T22:49:27.996Z] -J-Xmx512m \
[2025-06-19T22:49:27.996Z] -J-Dtest.vm.opts='-ea -esa -Xmx512m' \
[2025-06-19T22:49:27.996Z] -J-Dtest.tool.vm.opts='-J-ea -J-esa -J-Xmx512m' \
[2025-06-19T22:49:27.996Z] -J-Dtest.compiler.opts= \
[2025-06-19T22:49:27.996Z] -J-Dtest.java.opts= \
[2025-06-19T22:49:27.996Z] -J-Dtest.jdk='c:\jenkins\workspace\Test_openjdk11_hs_extended.openjdk_x86-32_windows_testList_1\jdkbinary\j2sdk-image' \
[2025-06-19T22:49:27.996Z] -J-Dcompile.jdk='c:\jenkins\workspace\Test_openjdk11_hs_extended.openjdk_x86-32_windows_testList_1\jdkbinary\j2sdk-image' \
[2025-06-19T22:49:27.996Z] -J-Dtest.timeout.factor=8.0 \
[2025-06-19T22:49:27.996Z] -J-Dtest.nativepath='c:\jenkins\workspace\Test_openjdk11_hs_extended.openjdk_x86-32_windows_testList_1\jdkbinary\openjdk-test-image\hotspot\jtreg\native' \
[2025-06-19T22:49:27.996Z] -J-Dtest.root='C:\jenkins\workspace\Test_openjdk11_hs_extended.openjdk_x86-32_windows_testList_1\aqa-tests\openjdk\openjdk-jdk\test\hotspot\jtreg' \
[2025-06-19T22:49:27.996Z] -J-Dtest.name=runtime/handshake/HandshakeWalkExitTest.java \
[2025-06-19T22:49:27.996Z] -J-Dtest.file='C:\jenkins\workspace\Test_openjdk11_hs_extended.openjdk_x86-32_windows_testList_1\aqa-tests\openjdk\openjdk-jdk\test\hotspot\jtreg\runtime\handshake\HandshakeWalkExitTest.java' \
[2025-06-19T22:49:27.996Z] -J-Dtest.src='C:\jenkins\workspace\Test_openjdk11_hs_extended.openjdk_x86-32_windows_testList_1\aqa-tests\openjdk\openjdk-jdk\test\hotspot\jtreg\runtime\handshake' \
[2025-06-19T22:49:27.996Z] -J-Dtest.src.path='C:\jenkins\workspace\Test_openjdk11_hs_extended.openjdk_x86-32_windows_testList_1\aqa-tests\openjdk\openjdk-jdk\test\hotspot\jtreg\runtime\handshake;C:\jenkins\workspace\Test_openjdk11_hs_extended.openjdk_x86-32_windows_testList_1\aqa-tests\openjdk\openjdk-jdk\test\hotspot\jtreg\testlibrary;C:\jenkins\workspace\Test_openjdk11_hs_extended.openjdk_x86-32_windows_testList_1\aqa-tests\openjdk\openjdk-jdk\test\lib' \
[2025-06-19T22:49:27.996Z] -J-Dtest.classes='C:\jenkins\workspace\Test_openjdk11_hs_extended.openjdk_x86-32_windows_testList_1\aqa-tests\TKG\output_1750365128106\hotspot_runtime_0\work\classes\1\runtime\handshake\HandshakeWalkExitTest.d' \
[2025-06-19T22:49:27.996Z] -J-Dtest.class.path='C:\jenkins\workspace\Test_openjdk11_hs_extended.openjdk_x86-32_windows_testList_1\aqa-tests\TKG\output_1750365128106\hotspot_runtime_0\work\classes\1\runtime\handshake\HandshakeWalkExitTest.d;C:\jenkins\workspace\Test_openjdk11_hs_extended.openjdk_x86-32_windows_testList_1\aqa-tests\TKG\output_1750365128106\hotspot_runtime_0\work\classes\1\testlibrary;C:\jenkins\workspace\Test_openjdk11_hs_extended.openjdk_x86-32_windows_testList_1\aqa-tests\TKG\output_1750365128106\hotspot_runtime_0\work\classes\1\test\lib' \
[2025-06-19T22:49:27.997Z] -J-Dtest.class.path.prefix='C:\jenkins\workspace\Test_openjdk11_hs_extended.openjdk_x86-32_windows_testList_1\aqa-tests\TKG\output_1750365128106\hotspot_runtime_0\work\classes\1\runtime\handshake\HandshakeWalkExitTest.d;C:\jenkins\workspace\Test_openjdk11_hs_extended.openjdk_x86-32_windows_testList_1\aqa-tests\openjdk\openjdk-jdk\test\hotspot\jtreg\runtime\handshake;C:\jenkins\workspace\Test_openjdk11_hs_extended.openjdk_x86-32_windows_testList_1\aqa-tests\TKG\output_1750365128106\hotspot_runtime_0\work\classes\1\testlibrary;C:\jenkins\workspace\Test_openjdk11_hs_extended.openjdk_x86-32_windows_testList_1\aqa-tests\TKG\output_1750365128106\hotspot_runtime_0\work\classes\1\test\lib' \
[2025-06-19T22:49:27.997Z] -d 'C:\jenkins\workspace\Test_openjdk11_hs_extended.openjdk_x86-32_windows_testList_1\aqa-tests\TKG\output_1750365128106\hotspot_runtime_0\work\classes\1\runtime\handshake\HandshakeWalkExitTest.d' \
[2025-06-19T22:49:27.997Z] -sourcepath 'C:\jenkins\workspace\Test_openjdk11_hs_extended.openjdk_x86-32_windows_testList_1\aqa-tests\openjdk\openjdk-jdk\test\hotspot\jtreg\runtime\handshake;C:\jenkins\workspace\Test_openjdk11_hs_extended.openjdk_x86-32_windows_testList_1\aqa-tests\openjdk\openjdk-jdk\test\hotspot\jtreg\testlibrary;C:\jenkins\workspace\Test_openjdk11_hs_extended.openjdk_x86-32_windows_testList_1\aqa-tests\openjdk\openjdk-jdk\test\lib' \
[2025-06-19T22:49:27.997Z] -classpath 'C:\jenkins\workspace\Test_openjdk11_hs_extended.openjdk_x86-32_windows_testList_1\aqa-tests\openjdk\openjdk-jdk\test\hotspot\jtreg\runtime\handshake;C:\jenkins\workspace\Test_openjdk11_hs_extended.openjdk_x86-32_windows_testList_1\aqa-tests\TKG\output_1750365128106\hotspot_runtime_0\work\classes\1\runtime\handshake\HandshakeWalkExitTest.d;C:\jenkins\workspace\Test_openjdk11_hs_extended.openjdk_x86-32_windows_testList_1\aqa-tests\TKG\output_1750365128106\hotspot_runtime_0\work\classes\1\testlibrary;C:\jenkins\workspace\Test_openjdk11_hs_extended.openjdk_x86-32_windows_testList_1\aqa-tests\TKG\output_1750365128106\hotspot_runtime_0\work\classes\1\test\lib' 'C:\jenkins\workspace\Test_openjdk11_hs_extended.openjdk_x86-32_windows_testList_1\aqa-tests\openjdk\openjdk-jdk\test\hotspot\jtreg\runtime\handshake\HandshakeWalkExitTest.java'
[2025-06-19T22:49:27.997Z]
[2025-06-19T22:49:27.997Z] ACTION: build -- Passed. All files up to date
[2025-06-19T22:49:27.997Z] REASON: Named class compiled on demand
[2025-06-19T22:49:27.997Z] TIME: 0.002 seconds
[2025-06-19T22:49:27.997Z] messages:
[2025-06-19T22:49:27.997Z] command: build ClassFileInstaller
[2025-06-19T22:49:27.997Z] reason: Named class compiled on demand
[2025-06-19T22:49:27.997Z] started: Thu Jun 19 22:49:19 GMT 2025
[2025-06-19T22:49:27.997Z] finished: Thu Jun 19 22:49:19 GMT 2025
[2025-06-19T22:49:27.997Z] elapsed time (seconds): 0.002
[2025-06-19T22:49:27.997Z]
[2025-06-19T22:49:27.997Z] ACTION: driver -- Passed. Execution successful
[2025-06-19T22:49:27.997Z] REASON: User specified action: run driver ClassFileInstaller sun.hotspot.WhiteBox sun.hotspot.WhiteBox$WhiteBoxPermission
[2025-06-19T22:49:27.997Z] TIME: 0.66 seconds
[2025-06-19T22:49:27.997Z] messages:
[2025-06-19T22:49:27.997Z] command: driver ClassFileInstaller sun.hotspot.WhiteBox sun.hotspot.WhiteBox$WhiteBoxPermission
[2025-06-19T22:49:27.997Z] reason: User specified action: run driver ClassFileInstaller sun.hotspot.WhiteBox sun.hotspot.WhiteBox$WhiteBoxPermission
[2025-06-19T22:49:27.997Z] started: Thu Jun 19 22:49:19 GMT 2025
[2025-06-19T22:49:27.997Z] Mode: agentvm
[2025-06-19T22:49:27.997Z] Agent id: 20
[2025-06-19T22:49:27.997Z] finished: Thu Jun 19 22:49:20 GMT 2025
[2025-06-19T22:49:27.997Z] elapsed time (seconds): 0.66
[2025-06-19T22:49:27.997Z] configuration:
[2025-06-19T22:49:27.997Z] Boot Layer
[2025-06-19T22:49:27.997Z] class path: C:\jenkins\workspace\Test_openjdk11_hs_extended.openjdk_x86-32_windows_testList_1\jvmtest\openjdk\jtreg\lib\javatest.jar
[2025-06-19T22:49:27.997Z] C:\jenkins\workspace\Test_openjdk11_hs_extended.openjdk_x86-32_windows_testList_1\jvmtest\openjdk\jtreg\lib\jtreg.jar
[2025-06-19T22:49:27.997Z] C:\jenkins\workspace\Test_openjdk11_hs_extended.openjdk_x86-32_windows_testList_1\jvmtest\openjdk\jtreg\lib\junit-platform-console-standalone-1.9.2.jar
[2025-06-19T22:49:27.997Z] C:\jenkins\workspace\Test_openjdk11_hs_extended.openjdk_x86-32_windows_testList_1\jvmtest\openjdk\jtreg\lib\testng-7.3.0.jar
[2025-06-19T22:49:27.997Z] C:\jenkins\workspace\Test_openjdk11_hs_extended.openjdk_x86-32_windows_testList_1\jvmtest\openjdk\jtreg\lib\guice-5.1.0.jar
[2025-06-19T22:49:27.997Z] C:\jenkins\workspace\Test_openjdk11_hs_extended.openjdk_x86-32_windows_testList_1\jvmtest\openjdk\jtreg\lib\jcommander-1.82.jar
[2025-06-19T22:49:27.997Z] patch: java.base C:\jenkins\workspace\Test_openjdk11_hs_extended.openjdk_x86-32_windows_testList_1\aqa-tests\TKG\output_1750365128106\hotspot_runtime_0\work\patches\java.base
[2025-06-19T22:49:27.997Z]
[2025-06-19T22:49:27.997Z] Test Layer
[2025-06-19T22:49:27.997Z] class path: C:\jenkins\workspace\Test_openjdk11_hs_extended.openjdk_x86-32_windows_testList_1\aqa-tests\TKG\output_1750365128106\hotspot_runtime_0\work\classes\1\runtime\handshake\HandshakeWalkExitTest.d
[2025-06-19T22:49:27.997Z] C:\jenkins\workspace\Test_openjdk11_hs_extended.openjdk_x86-32_windows_testList_1\aqa-tests\openjdk\openjdk-jdk\test\hotspot\jtreg\runtime\handshake
[2025-06-19T22:49:27.997Z] C:\jenkins\workspace\Test_openjdk11_hs_extended.openjdk_x86-32_windows_testList_1\aqa-tests\TKG\output_1750365128106\hotspot_runtime_0\work\classes\1\testlibrary
[2025-06-19T22:49:27.997Z] C:\jenkins\workspace\Test_openjdk11_hs_extended.openjdk_x86-32_windows_testList_1\aqa-tests\openjdk\openjdk-jdk\test\hotspot\jtreg\testlibrary
[2025-06-19T22:49:27.997Z] C:\jenkins\workspace\Test_openjdk11_hs_extended.openjdk_x86-32_windows_testList_1\aqa-tests\TKG\output_1750365128106\hotspot_runtime_0\work\classes\1\test\lib
[2025-06-19T22:49:27.997Z] C:\jenkins\workspace\Test_openjdk11_hs_extended.openjdk_x86-32_windows_testList_1\aqa-tests\openjdk\openjdk-jdk\test\lib
[2025-06-19T22:49:27.997Z]
[2025-06-19T22:49:27.997Z] rerun:
[2025-06-19T22:49:27.997Z] cd 'C:\jenkins\workspace\Test_openjdk11_hs_extended.openjdk_x86-32_windows_testList_1\aqa-tests\TKG\output_1750365128106\hotspot_runtime_0\work\scratch\0' && \
[2025-06-19T22:49:27.997Z] PATH='C:\Program Files\Java\jdk-17.0.13+11\bin;C:\cygwin64\bin;C:\Windows\system32;C:\Windows;C:\Windows\System32\Wbem;C:\Windows\System32\WindowsPowerShell\v1.0;C:\Windows\System32\OpenSSH;C:\Program Files\dotnet;C:\Users\adoptopenjdk\AppData\Local\Microsoft\WindowsApps;C:\Strawberry\perl\bin;C:\Program Files\Git\cmd;C:\openjdk\jdk-8\bin;C:\apache-ant\apache-ant-1.10.15\bin;C:\Program Files (x86)\IncrediBuild;C:\Program Files (x86)\Windows Kits\10\Windows Performance Toolkit;C:\rust\bin;C:\Program Files\IcedTeaWEB\bin;C:\Users\jenkins\AppData\Local\Microsoft\WindowsApps' \
[2025-06-19T22:49:27.997Z] SystemDrive=C: \
[2025-06-19T22:49:27.997Z] SystemRoot='C:\Windows' \
[2025-06-19T22:49:27.997Z] TEMP='C:\Users\jenkins\AppData\Local\Temp\2' \
[2025-06-19T22:49:27.997Z] TMP='C:\Users\jenkins\AppData\Local\Temp\2' \
[2025-06-19T22:49:27.997Z] windir='C:\Windows' \
[2025-06-19T22:49:27.997Z] 'c:\jenkins\workspace\Test_openjdk11_hs_extended.openjdk_x86-32_windows_testList_1\jdkbinary\j2sdk-image\bin\java' \
[2025-06-19T22:49:27.997Z] -Dtest.vm.opts='-ea -esa -Xmx512m' \
[2025-06-19T22:49:27.997Z] -Dtest.tool.vm.opts='-J-ea -J-esa -J-Xmx512m' \
[2025-06-19T22:49:27.997Z] -Dtest.compiler.opts= \
[2025-06-19T22:49:27.997Z] -Dtest.java.opts= \
[2025-06-19T22:49:27.997Z] -Dtest.jdk='c:\jenkins\workspace\Test_openjdk11_hs_extended.openjdk_x86-32_windows_testList_1\jdkbinary\j2sdk-image' \
[2025-06-19T22:49:27.997Z] -Dcompile.jdk='c:\jenkins\workspace\Test_openjdk11_hs_extended.openjdk_x86-32_windows_testList_1\jdkbinary\j2sdk-image' \
[2025-06-19T22:49:27.997Z] -Dtest.timeout.factor=8.0 \
[2025-06-19T22:49:27.997Z] -Dtest.nativepath='c:\jenkins\workspace\Test_openjdk11_hs_extended.openjdk_x86-32_windows_testList_1\jdkbinary\openjdk-test-image\hotspot\jtreg\native' \
[2025-06-19T22:49:27.997Z] -Dtest.root='C:\jenkins\workspace\Test_openjdk11_hs_extended.openjdk_x86-32_windows_testList_1\aqa-tests\openjdk\openjdk-jdk\test\hotspot\jtreg' \
[2025-06-19T22:49:27.997Z] -Dtest.name=runtime/handshake/HandshakeWalkExitTest.java \
[2025-06-19T22:49:27.997Z] -Dtest.file='C:\jenkins\workspace\Test_openjdk11_hs_extended.openjdk_x86-32_windows_testList_1\aqa-tests\openjdk\openjdk-jdk\test\hotspot\jtreg\runtime\handshake\HandshakeWalkExitTest.java' \
[2025-06-19T22:49:27.997Z] -Dtest.src='C:\jenkins\workspace\Test_openjdk11_hs_extended.openjdk_x86-32_windows_testList_1\aqa-tests\openjdk\openjdk-jdk\test\hotspot\jtreg\runtime\handshake' \
[2025-06-19T22:49:27.997Z] -Dtest.src.path='C:\jenkins\workspace\Test_openjdk11_hs_extended.openjdk_x86-32_windows_testList_1\aqa-tests\openjdk\openjdk-jdk\test\hotspot\jtreg\runtime\handshake;C:\jenkins\workspace\Test_openjdk11_hs_extended.openjdk_x86-32_windows_testList_1\aqa-tests\openjdk\openjdk-jdk\test\hotspot\jtreg\testlibrary;C:\jenkins\workspace\Test_openjdk11_hs_extended.openjdk_x86-32_windows_testList_1\aqa-tests\openjdk\openjdk-jdk\test\lib' \
[2025-06-19T22:49:27.997Z] -Dtest.classes='C:\jenkins\workspace\Test_openjdk11_hs_extended.openjdk_x86-32_windows_testList_1\aqa-tests\TKG\output_1750365128106\hotspot_runtime_0\work\classes\1\runtime\handshake\HandshakeWalkExitTest.d' \
[2025-06-19T22:49:27.997Z] -Dtest.class.path='C:\jenkins\workspace\Test_openjdk11_hs_extended.openjdk_x86-32_windows_testList_1\aqa-tests\TKG\output_1750365128106\hotspot_runtime_0\work\classes\1\runtime\handshake\HandshakeWalkExitTest.d;C:\jenkins\workspace\Test_openjdk11_hs_extended.openjdk_x86-32_windows_testList_1\aqa-tests\TKG\output_1750365128106\hotspot_runtime_0\work\classes\1\testlibrary;C:\jenkins\workspace\Test_openjdk11_hs_extended.openjdk_x86-32_windows_testList_1\aqa-tests\TKG\output_1750365128106\hotspot_runtime_0\work\classes\1\test\lib' \
[2025-06-19T22:49:27.998Z] -Dtest.class.path.prefix='C:\jenkins\workspace\Test_openjdk11_hs_extended.openjdk_x86-32_windows_testList_1\aqa-tests\TKG\output_1750365128106\hotspot_runtime_0\work\classes\1\runtime\handshake\HandshakeWalkExitTest.d;C:\jenkins\workspace\Test_openjdk11_hs_extended.openjdk_x86-32_windows_testList_1\aqa-tests\openjdk\openjdk-jdk\test\hotspot\jtreg\runtime\handshake;C:\jenkins\workspace\Test_openjdk11_hs_extended.openjdk_x86-32_windows_testList_1\aqa-tests\TKG\output_1750365128106\hotspot_runtime_0\work\classes\1\testlibrary;C:\jenkins\workspace\Test_openjdk11_hs_extended.openjdk_x86-32_windows_testList_1\aqa-tests\TKG\output_1750365128106\hotspot_runtime_0\work\classes\1\test\lib' \
[2025-06-19T22:49:27.998Z] -classpath 'C:\jenkins\workspace\Test_openjdk11_hs_extended.openjdk_x86-32_windows_testList_1\aqa-tests\TKG\output_1750365128106\hotspot_runtime_0\work\classes\1\runtime\handshake\HandshakeWalkExitTest.d;C:\jenkins\workspace\Test_openjdk11_hs_extended.openjdk_x86-32_windows_testList_1\aqa-tests\openjdk\openjdk-jdk\test\hotspot\jtreg\runtime\handshake;C:\jenkins\workspace\Test_openjdk11_hs_extended.openjdk_x86-32_windows_testList_1\aqa-tests\TKG\output_1750365128106\hotspot_runtime_0\work\classes\1\testlibrary;C:\jenkins\workspace\Test_openjdk11_hs_extended.openjdk_x86-32_windows_testList_1\aqa-tests\openjdk\openjdk-jdk\test\hotspot\jtreg\testlibrary;C:\jenkins\workspace\Test_openjdk11_hs_extended.openjdk_x86-32_windows_testList_1\aqa-tests\TKG\output_1750365128106\hotspot_runtime_0\work\classes\1\test\lib;C:\jenkins\workspace\Test_openjdk11_hs_extended.openjdk_x86-32_windows_testList_1\aqa-tests\openjdk\openjdk-jdk\test\lib;C:\jenkins\workspace\Test_openjdk11_hs_extended.openjdk_x86-32_windows_testList_1\jvmtest\openjdk\jtreg\lib\javatest.jar;C:\jenkins\workspace\Test_openjdk11_hs_extended.openjdk_x86-32_windows_testList_1\jvmtest\openjdk\jtreg\lib\jtreg.jar' \
[2025-06-19T22:49:27.998Z] ClassFileInstaller sun.hotspot.WhiteBox 'sun.hotspot.WhiteBox$WhiteBoxPermission'
[2025-06-19T22:49:27.998Z] STDERR:
[2025-06-19T22:49:27.998Z]
[2025-06-19T22:49:27.998Z] JavaTest Message: Test complete.
[2025-06-19T22:49:27.998Z]
[2025-06-19T22:49:27.998Z]
[2025-06-19T22:49:27.998Z] ACTION: build -- Passed. All files up to date
[2025-06-19T22:49:27.998Z] REASON: Named class compiled on demand
[2025-06-19T22:49:27.998Z] TIME: 0.015 seconds
[2025-06-19T22:49:27.998Z] messages:
[2025-06-19T22:49:27.998Z] command: build HandshakeWalkExitTest
[2025-06-19T22:49:27.998Z] reason: Named class compiled on demand
[2025-06-19T22:49:27.998Z] started: Thu Jun 19 22:49:20 GMT 2025
[2025-06-19T22:49:27.998Z] finished: Thu Jun 19 22:49:20 GMT 2025
[2025-06-19T22:49:27.998Z] elapsed time (seconds): 0.015
[2025-06-19T22:49:27.998Z]
[2025-06-19T22:49:27.998Z] ACTION: main -- Failed. Execution failed: `main' threw exception: java.lang.OutOfMemoryError: unable to create native thread: possibly out of memory or process/resource limits reached
[2025-06-19T22:49:27.998Z] REASON: User specified action: run main/othervm -Xbootclasspath/a:. -XX:+UnlockDiagnosticVMOptions -XX:+WhiteBoxAPI HandshakeWalkExitTest
[2025-06-19T22:49:27.998Z] TIME: 1.391 seconds
[2025-06-19T22:49:27.998Z] messages:
[2025-06-19T22:49:27.998Z] command: main -Xbootclasspath/a:. -XX:+UnlockDiagnosticVMOptions -XX:+WhiteBoxAPI HandshakeWalkExitTest
[2025-06-19T22:49:27.998Z] reason: User specified action: run main/othervm -Xbootclasspath/a:. -XX:+UnlockDiagnosticVMOptions -XX:+WhiteBoxAPI HandshakeWalkExitTest
[2025-06-19T22:49:27.998Z] started: Thu Jun 19 22:49:20 GMT 2025
[2025-06-19T22:49:27.998Z] Mode: othervm [/othervm specified]
[2025-06-19T22:49:27.998Z] finished: Thu Jun 19 22:49:21 GMT 2025
[2025-06-19T22:49:27.998Z] elapsed time (seconds): 1.391
[2025-06-19T22:49:27.998Z] configuration:
[2025-06-19T22:49:27.998Z] STDOUT:
[2025-06-19T22:49:27.998Z] [0.651s][warning][os,thread] Failed to start thread "Unknown thread" - _beginthreadex failed (ENOMEM) for attributes: stacksize: default, flags: CREATE_SUSPENDED STACK_SIZE_PARAM_IS.
[2025-06-19T22:49:27.998Z] [0.651s][warning][os,thread] Failed to start the native thread for java.lang.Thread "Thread-2381"
[2025-06-19T22:49:27.998Z] "main" #1 prio=5 os_prio=0 cpu=140.62ms elapsed=1.05s tid=0x023a4c00 nid=0xe8e4 in Object.wait() [0x022ff000]
[2025-06-19T22:49:27.998Z] java.lang.Thread.State: WAITING (on object monitor)
[2025-06-19T22:49:27.998Z] at java.lang.Object.wait(java.base@11.0.28-beta/Native Method)
[2025-06-19T22:49:27.998Z] - waiting on <0x04b47470> (a java.lang.Thread)
[2025-06-19T22:49:27.998Z] at java.lang.Thread.join(java.base@11.0.28-beta/Thread.java:1300)
[2025-06-19T22:49:27.998Z] - waiting to re-lock in wait() <0x04b47470> (a java.lang.Thread)
[2025-06-19T22:49:27.998Z] at java.lang.Thread.join(java.base@11.0.28-beta/Thread.java:1375)
[2025-06-19T22:49:27.998Z] at com.sun.javatest.regtest.agent.MainWrapper.main(MainWrapper.java:85)
[2025-06-19T22:49:27.998Z]
[2025-06-19T22:49:27.998Z] "Reference Handler" #2 daemon prio=10 os_prio=2 cpu=0.00ms elapsed=1.02s tid=0x0245b000 nid=0x7308 waiting on condition [0x24f7f000]
[2025-06-19T22:49:27.998Z] java.lang.Thread.State: RUNNABLE
[2025-06-19T22:49:27.998Z] at java.lang.ref.Reference.waitForReferencePendingList(java.base@11.0.28-beta/Native Method)
[2025-06-19T22:49:27.998Z] at java.lang.ref.Reference.processPendingReferences(java.base@11.0.28-beta/Reference.java:241)
[2025-06-19T22:49:27.998Z] at java.lang.ref.Reference$ReferenceHandler.run(java.base@11.0.28-beta/Reference.java:213)
[2025-06-19T22:49:27.998Z]
[2025-06-19T22:49:27.998Z] "Finalizer" #3 daemon prio=8 os_prio=1 cpu=0.00ms elapsed=1.02s tid=0x0245c800 nid=0x9ab0 in Object.wait() [0x2500f000]
[2025-06-19T22:49:27.998Z] java.lang.Thread.State: WAITING (on object monitor)
[2025-06-19T22:49:27.998Z] at java.lang.Object.wait(java.base@11.0.28-beta/Native Method)
[2025-06-19T22:49:27.998Z] - waiting on <0x04a07e98> (a java.lang.ref.ReferenceQueue$Lock)
[2025-06-19T22:49:27.998Z] at java.lang.ref.ReferenceQueue.remove(java.base@11.0.28-beta/ReferenceQueue.java:155)
[2025-06-19T22:49:27.998Z] - waiting to re-lock in wait() <0x04a07e98> (a java.lang.ref.ReferenceQueue$Lock)
[2025-06-19T22:49:27.998Z] at java.lang.ref.ReferenceQueue.remove(java.base@11.0.28-beta/ReferenceQueue.java:176)
[2025-06-19T22:49:27.998Z] at java.lang.ref.Finalizer$FinalizerThread.run(java.base@11.0.28-beta/Finalizer.java:170)
[2025-06-19T22:49:27.998Z]
[2025-06-19T22:49:27.998Z] "Signal Dispatcher" #4 daemon prio=9 os_prio=2 cpu=0.00ms elapsed=0.99s tid=0x0247f400 nid=0x3a54 runnable [0x00000000]
[2025-06-19T22:49:27.998Z] java.lang.Thread.State: RUNNABLE
[2025-06-19T22:49:27.998Z]
[2025-06-19T22:49:27.998Z] "Attach Listener" #5 daemon prio=5 os_prio=2 cpu=0.00ms elapsed=0.99s tid=0x02480000 nid=0x60a8 runnable [0x00000000]
[2025-06-19T22:49:27.998Z] java.lang.Thread.State: RUNNABLE
[2025-06-19T22:49:27.998Z]
[2025-06-19T22:49:27.998Z] "Service Thread" #6 daemon prio=9 os_prio=0 cpu=0.00ms elapsed=0.99s tid=0x02480c00 nid=0x28e8 runnable [0x00000000]
[2025-06-19T22:49:27.998Z] java.lang.Thread.State: RUNNABLE
[2025-06-19T22:49:27.998Z]
[2025-06-19T22:49:27.998Z] "C1 CompilerThread0" #7 daemon prio=9 os_prio=2 cpu=31.25ms elapsed=0.99s tid=0x02481c00 nid=0xf740 waiting on condition [0x00000000]
[2025-06-19T22:49:27.998Z] java.lang.Thread.State: RUNNABLE
[2025-06-19T22:49:27.998Z] No compile task
[2025-06-19T22:49:27.998Z]
[2025-06-19T22:49:27.998Z] "Sweeper thread" #8 daemon prio=9 os_prio=2 cpu=0.00ms elapsed=0.99s tid=0x25149400 nid=0x1e40 runnable [0x00000000]
[2025-06-19T22:49:27.998Z] java.lang.Thread.State: RUNNABLE
[2025-06-19T22:49:27.998Z]
[2025-06-19T22:49:27.998Z] "Common-Cleaner" #9 daemon prio=8 os_prio=1 cpu=0.00ms elapsed=0.94s tid=0x251d1c00 nid=0x10cf8 in Object.wait() [0x2570f000]
[2025-06-19T22:49:27.998Z] java.lang.Thread.State: TIMED_WAITING (on object monitor)
[2025-06-19T22:49:27.998Z] at java.lang.Object.wait(java.base@11.0.28-beta/Native Method)
[2025-06-19T22:49:27.998Z] - waiting on <0x04acf178> (a java.lang.ref.ReferenceQueue$Lock)
[2025-06-19T22:49:27.998Z] at java.lang.ref.ReferenceQueue.remove(java.base@11.0.28-beta/ReferenceQueue.java:155)
[2025-06-19T22:49:27.998Z] - waiting to re-lock in wait() <0x04acf178> (a java.lang.ref.ReferenceQueue$Lock)
[2025-06-19T22:49:27.998Z] at jdk.internal.ref.CleanerImpl.run(java.base@11.0.28-beta/CleanerImpl.java:148)
[2025-06-19T22:49:27.998Z] at java.lang.Thread.run(java.base@11.0.28-beta/Thread.java:829)
[2025-06-19T22:49:27.998Z] at jdk.internal.misc.InnocuousThread.run(java.base@11.0.28-beta/InnocuousThread.java:161)
[2025-06-19T22:49:27.998Z]
[2025-06-19T22:49:27.998Z] "MainThread" #10 prio=5 os_prio=0 cpu=250.00ms elapsed=0.87s tid=0x25290400 nid=0xd9d4 waiting on condition [0x2579e000]
[2025-06-19T22:49:27.998Z] java.lang.Thread.State: RUNNABLE
[2025-06-19T22:49:27.998Z] at java.util.zip.ZipFile$CleanableResource.getInflater(java.base@11.0.28-beta/ZipFile.java:757)
[2025-06-19T22:49:27.998Z] - locked <0x04ae82a8> (a java.util.ArrayDeque)
[2025-06-19T22:49:27.998Z] at java.util.zip.ZipFile$ZipFileInflaterInputStream.<init>(java.base@11.0.28-beta/ZipFile.java:450)
[2025-06-19T22:49:27.998Z] at java.util.zip.ZipFile.getInputStream(java.base@11.0.28-beta/ZipFile.java:417)
[2025-06-19T22:49:27.998Z] - locked <0x04ae7ff8> (a java.util.jar.JarFile)
[2025-06-19T22:49:27.998Z] at java.util.jar.JarFile.getInputStream(java.base@11.0.28-beta/JarFile.java:853)
[2025-06-19T22:49:27.998Z] - locked <0x04ae7ff8> (a java.util.jar.JarFile)
[2025-06-19T22:49:27.998Z] at jdk.internal.loader.URLClassPath$JarLoader$2.getInputStream(java.base@11.0.28-beta/URLClassPath.java:870)
[2025-06-19T22:49:27.998Z] at jdk.internal.loader.Resource.cachedInputStream(java.base@11.0.28-beta/Resource.java:77)
[2025-06-19T22:49:27.998Z] - locked <0x04ccfa98> (a jdk.internal.loader.URLClassPath$JarLoader$2)
[2025-06-19T22:49:27.998Z] at jdk.internal.loader.Resource.getByteBuffer(java.base@11.0.28-beta/Resource.java:161)
[2025-06-19T22:49:27.998Z] at jdk.internal.loader.BuiltinClassLoader.defineClass(java.base@11.0.28-beta/BuiltinClassLoader.java:791)
[2025-06-19T22:49:27.998Z] at jdk.internal.loader.BuiltinClassLoader.findClassOnClassPathOrNull(java.base@11.0.28-beta/BuiltinClassLoader.java:698)
[2025-06-19T22:49:27.998Z] at jdk.internal.loader.BuiltinClassLoader.loadClassOrNull(java.base@11.0.28-beta/BuiltinClassLoader.java:621)
[2025-06-19T22:49:27.998Z] - locked <0x04ccb388> (a java.lang.Object)
[2025-06-19T22:49:27.998Z] at jdk.internal.loader.BuiltinClassLoader.loadClass(java.base@11.0.28-beta/BuiltinClassLoader.java:579)
[2025-06-19T22:49:27.998Z] at jdk.internal.loader.ClassLoaders$AppClassLoader.loadClass(java.base@11.0.28-beta/ClassLoaders.java:178)
[2025-06-19T22:49:27.998Z] at java.lang.ClassLoader.loadClass(java.base@11.0.28-beta/ClassLoader.java:527)
[2025-06-19T22:49:27.998Z] at com.sun.javatest.regtest.agent.MainWrapper.handleTestException(MainWrapper.java:105)
[2025-06-19T22:49:27.998Z] at com.sun.javatest.regtest.agent.MainWrapper.access$000(MainWrapper.java:36)
[2025-06-19T22:49:27.998Z] at com.sun.javatest.regtest.agent.MainWrapper$MainTask.run(MainWrapper.java:147)
[2025-06-19T22:49:27.999Z] at java.lang.Thread.run(java.base@11.0.28-beta/Thread.java:829)
[2025-06-19T22:49:27.999Z]
[2025-06-19T22:49:27.999Z] "Thread-1" #11 prio=5 os_prio=0 cpu=15.62ms elapsed=0.85s tid=0x252b3800 nid=0x7630 waiting on condition [0x2582f000]
[2025-06-19T22:49:27.999Z] java.lang.Thread.State: RUNNABLE
[2025-06-19T22:49:27.999Z] at sun.hotspot.WhiteBox.handshakeWalkStack(Native Method)
[2025-06-19T22:49:27.999Z] at HandshakeWalkExitTest$1.run(HandshakeWalkExitTest.java:56)
[2025-06-19T22:49:27.999Z] at java.lang.Thread.run(java.base@11.0.28-beta/Thread.java:829)
[2025-06-19T22:49:27.999Z]
[2025-06-19T22:49:27.999Z] "Thread-227" #237 prio=5 os_prio=0 cpu=0.00ms elapsed=0.83s tid=0x27eb3c00 nid=0xcec0 runnable [0x00000000]
[2025-06-19T22:49:27.999Z] java.lang.Thread.State: TERMINATED
[2025-06-19T22:49:27.999Z]
[2025-06-19T22:49:27.999Z] "Thread-228" #238 prio=5 os_prio=0 cpu=0.00ms elapsed=0.83s tid=0x27eb9800 nid=0x5ac0 runnable [0x00000000]
[2025-06-19T22:49:27.999Z] java.lang.Thread.State: TERMINATED
[2025-06-19T22:49:27.999Z]
[2025-06-19T22:49:27.999Z] "Thread-229" #239 prio=5 os_prio=0 cpu=0.00ms elapsed=0.83s tid=0x27eb7000 nid=0xaea8 runnable [0x00000000]
[2025-06-19T22:49:27.999Z] java.lang.Thread.State: TERMINATED
[2025-06-19T22:49:27.999Z]
[2025-06-19T22:49:27.999Z] "Thread-230" #240 prio=5 os_prio=0 cpu=0.00ms elapsed=0.83s tid=0x27eb8400 nid=0xd040 runnable [0x00000000]
[2025-06-19T22:49:27.999Z] java.lang.Thread.State: TERMINATED
[2025-06-19T22:49:27.999Z]
[2025-06-19T22:49:27.999Z] "Thread-232" #242 prio=5 os_prio=0 cpu=0.00ms elapsed=0.83s tid=0x27eb5800 nid=0x497c runnable [0x00000000]
[2025-06-19T22:49:27.999Z] java.lang.Thread.State: TERMINATED
[2025-06-19T22:49:27.999Z]
[2025-06-19T22:49:27.999Z] "Thread-233" #243 prio=5 os_prio=0 cpu=0.00ms elapsed=0.83s tid=0x27eb4400 nid=0x6284 runnable [0x00000000]
[2025-06-19T22:49:27.999Z] java.lang.Thread.State: TERMINATED
[2025-06-19T22:49:27.999Z]
[2025-06-19T22:49:27.999Z] "Thread-234" #244 prio=5 os_prio=0 cpu=0.00ms elapsed=0.83s tid=0x27eb6000 nid=0xcd60 runnable [0x00000000]
[2025-06-19T22:49:27.999Z] java.lang.Thread.State: TERMINATED
[2025-06-19T22:49:27.999Z]
[2025-06-19T22:49:27.999Z] "Thread-235" #245 prio=5 os_prio=0 cpu=0.00ms elapsed=0.83s tid=0x27eb4800 nid=0x27b4 runnable [0x00000000]
[2025-06-19T22:49:27.999Z] java.lang.Thread.State: TERMINATED
[2025-06-19T22:49:27.999Z]
[2025-06-19T22:49:27.999Z] "Thread-237" #247 prio=5 os_prio=0 cpu=0.00ms elapsed=0.83s tid=0x27eb5000 nid=0xcedc runnable [0x00000000]
[2025-06-19T22:49:27.999Z] java.lang.Thread.State: TERMINATED
[2025-06-19T22:49:27.999Z]
[2025-06-19T22:49:27.999Z] "Thread-239" #249 prio=5 os_prio=0 cpu=0.00ms elapsed=0.83s tid=0x27eb2c00 nid=0xc9e4 runnable [0x00000000]
[2025-06-19T22:49:27.999Z] java.lang.Thread.State: TERMINATED
[2025-06-19T22:49:27.999Z]
[2025-06-19T22:49:27.999Z] "Thread-240" #250 prio=5 os_prio=0 cpu=0.00ms elapsed=0.83s tid=0x27ec0000 nid=0x9d1c runnable [0x00000000]
[2025-06-19T22:49:27.999Z] java.lang.Thread.State: TERMINATED
[2025-06-19T22:49:27.999Z]
[2025-06-19T22:49:27.999Z] "Thread-241" #251 prio=5 os_prio=0 cpu=0.00ms elapsed=0.83s tid=0x27ebcc00 nid=0xa564 runnable [0x00000000]
[2025-06-19T22:49:27.999Z] java.lang.Thread.State: TERMINATED
[2025-06-19T22:49:27.999Z]
[2025-06-19T22:49:27.999Z] "Thread-242" #252 prio=5 os_prio=0 cpu=0.00ms elapsed=0.83s tid=0x27ebf000 nid=0x104b0 runnable [0x00000000]
[2025-06-19T22:49:27.999Z] java.lang.Thread.State: TERMINATED
[2025-06-19T22:49:27.999Z]
[2025-06-19T22:49:27.999Z] "Thread-243" #253 prio=5 os_prio=0 cpu=0.00ms elapsed=0.83s tid=0x27ebb000 nid=0xfa30 runnable [0x00000000]
[2025-06-19T22:49:27.999Z] java.lang.Thread.State: TERMINATED
[2025-06-19T22:49:27.999Z]
[2025-06-19T22:49:27.999Z] "Thread-244" #254 prio=5 os_prio=0 cpu=0.00ms elapsed=0.83s tid=0x27eba000 nid=0x2abc runnable [0x00000000]
[2025-06-19T22:49:27.999Z] java.lang.Thread.State: TERMINATED
[2025-06-19T22:49:27.999Z]
[2025-06-19T22:49:27.999Z] "Thread-245" #255 prio=5 os_prio=0 cpu=0.00ms elapsed=0.83s tid=0x27ebdc00 nid=0xe704 runnable [0x00000000]
[2025-06-19T22:49:27.999Z] java.lang.Thread.State: TERMINATED
[2025-06-19T22:49:27.999Z]
[2025-06-19T22:49:27.999Z] "Thread-246" #256 prio=5 os_prio=0 cpu=0.00ms elapsed=0.83s tid=0x27ec1000 nid=0xfa9c runnable [0x00000000]
[2025-06-19T22:49:27.999Z] java.lang.Thread.State: TERMINATED
[2025-06-19T22:49:27.999Z]
[2025-06-19T22:49:27.999Z] "Thread-247" #257 prio=5 os_prio=0 cpu=0.00ms elapsed=0.83s tid=0x27eba800 nid=0x60c8 runnable [0x00000000]
[2025-06-19T22:49:27.999Z] java.lang.Thread.State: TERMINATED
[2025-06-19T22:49:27.999Z]
[2025-06-19T22:49:27.999Z] "Thread-248" #258 prio=5 os_prio=0 cpu=0.00ms elapsed=0.83s tid=0x27ebe400 nid=0x4e30 runnable [0x00000000]
[2025-06-19T22:49:27.999Z] java.lang.Thread.State: TERMINATED
[2025-06-19T22:49:27.999Z]
[2025-06-19T22:49:27.999Z] "Thread-249" #259 prio=5 os_prio=0 cpu=0.00ms elapsed=0.83s tid=0x27ebb800 nid=0x1634 runnable [0x00000000]
[2025-06-19T22:49:27.999Z] java.lang.Thread.State: TERMINATED
[2025-06-19T22:49:27.999Z]
[2025-06-19T22:49:27.999Z] "Thread-250" #260 prio=5 os_prio=0 cpu=0.00ms elapsed=0.83s tid=0x27ec0800 nid=0x8b44 runnable [0x00000000]
[2025-06-19T22:49:27.999Z] java.lang.Thread.State: TERMINATED
[2025-06-19T22:49:27.999Z]
[2025-06-19T22:49:27.999Z] "Thread-251" #261 prio=5 os_prio=0 cpu=0.00ms elapsed=0.83s tid=0x27ebe800 nid=0x10048 runnable [0x00000000]
[2025-06-19T22:49:27.999Z] java.lang.Thread.State: TERMINATED
[2025-06-19T22:49:27.999Z]
[2025-06-19T22:49:27.999Z] "Thread-253" #263 prio=5 os_prio=0 cpu=0.00ms elapsed=0.83s tid=0x27ebc000 nid=0x106f8 runnable [0x00000000]
[2025-06-19T22:49:27.999Z] java.lang.Thread.State: TERMINATED
[2025-06-19T22:49:27.999Z]
[2025-06-19T22:49:27.999Z] "Thread-254" #264 prio=5 os_prio=0 cpu=0.00ms elapsed=0.83s tid=0x27ebd400 nid=0x46a8 runnable [0x00000000]
[2025-06-19T22:49:27.999Z] java.lang.Thread.State: TERMINATED
[2025-06-19T22:49:27.999Z]
[2025-06-19T22:49:27.999Z] "Thread-256" #266 prio=5 os_prio=0 cpu=0.00ms elapsed=0.83s tid=0x27ec1c00 nid=0xd94c runnable [0x00000000]
[2025-06-19T22:49:27.999Z] java.lang.Thread.State: TERMINATED
[2025-06-19T22:49:27.999Z]
[2025-06-19T22:49:27.999Z] "Thread-257" #267 prio=5 os_prio=0 cpu=0.00ms elapsed=0.83s tid=0x27ec2400 nid=0x3ce4 runnable [0x00000000]
[2025-06-19T22:49:27.999Z] java.lang.Thread.State: TERMINATED
[2025-06-19T22:49:27.999Z]
[2025-06-19T22:49:27.999Z] "Thread-258" #268 prio=5 os_prio=0 cpu=0.00ms elapsed=0.86s tid=0x27ec1400 nid=0x3458 runnable [0x00000000]
[2025-06-19T22:49:27.999Z] java.lang.Thread.State: TERMINATED
[2025-06-19T22:49:27.999Z]
[2025-06-19T22:49:27.999Z] "Thread-259" #269 prio=5 os_prio=0 cpu=0.00ms elapsed=0.86s tid=0x27ed8c00 nid=0xcdcc runnable [0x00000000]
[2025-06-19T22:49:27.999Z] java.lang.Thread.State: TERMINATED
[2025-06-19T22:49:27.999Z]
[2025-06-19T22:49:27.999Z] "Thread-260" #270 prio=5 os_prio=0 cpu=0.00ms elapsed=0.86s tid=0x27ed7800 nid=0x4644 runnable [0x00000000]
[2025-06-19T22:49:27.999Z] java.lang.Thread.State: TERMINATED
[2025-06-19T22:49:27.999Z]
[2025-06-19T22:49:27.999Z] "Thread-262" #272 prio=5 os_prio=0 cpu=0.00ms elapsed=0.86s tid=0x27ed6800 nid=0x6b8c runnable [0x00000000]
[2025-06-19T22:49:27.999Z] java.lang.Thread.State: TERMINATED
[2025-06-19T22:49:27.999Z]
[2025-06-19T22:49:27.999Z] "Thread-264" #274 prio=5 os_prio=0 cpu=0.00ms elapsed=0.86s tid=0x27ed8400 nid=0xc43c runnable [0x00000000]
[2025-06-19T22:49:27.999Z] java.lang.Thread.State: TERMINATED
[2025-06-19T22:49:27.999Z]
[2025-06-19T22:49:27.999Z] "Thread-265" #275 prio=5 os_prio=0 cpu=0.00ms elapsed=0.86s tid=0x27ed9400 nid=0x767c runnable [0x00000000]
[2025-06-19T22:49:27.999Z] java.lang.Thread.State: TERMINATED
[2025-06-19T22:49:27.999Z]
[2025-06-19T22:49:27.999Z] "Thread-268" #278 prio=5 os_prio=0 cpu=0.00ms elapsed=0.86s tid=0x27ed9c00 nid=0x1cb8 runnable [0x00000000]
[2025-06-19T22:49:27.999Z] java.lang.Thread.State: TERMINATED
[2025-06-19T22:49:27.999Z]
[2025-06-19T22:49:27.999Z] "Thread-269" #279 prio=5 os_prio=0 cpu=0.00ms elapsed=0.86s tid=0x27ed4c00 nid=0x395c runnable [0x00000000]
[2025-06-19T22:49:27.999Z] java.lang.Thread.State: TERMINATED
[2025-06-19T22:49:27.999Z]
[2025-06-19T22:49:27.999Z] "Thread-270" #280 prio=5 os_prio=0 cpu=0.00ms elapsed=0.86s tid=0x27eda400 nid=0x6824 runnable [0x00000000]
[2025-06-19T22:49:27.999Z] java.lang.Thread.State: TERMINATED
[2025-06-19T22:49:27.999Z]
[2025-06-19T22:49:27.999Z] "Thread-271" #281 prio=5 os_prio=0 cpu=0.00ms elapsed=0.86s tid=0x27ed3400 nid=0x7ff8 runnable [0x00000000]
[2025-06-19T22:49:27.999Z] java.lang.Thread.State: TERMINATED
[2025-06-19T22:49:27.999Z]
[2025-06-19T22:49:27.999Z] "Thread-273" #283 prio=5 os_prio=0 cpu=0.00ms elapsed=0.86s tid=0x27eda800 nid=0x9b7c runnable [0x00000000]
[2025-06-19T22:49:27.999Z] java.lang.Thread.State: TERMINATED
[2025-06-19T22:49:27.999Z]
[2025-06-19T22:49:27.999Z] "Thread-276" #286 prio=5 os_prio=0 cpu=15.62ms elapsed=0.85s tid=0x27ed4400 nid=0x2364 runnable [0x00000000]
[2025-06-19T22:49:27.999Z] java.lang.Thread.State: TERMINATED
[2025-06-19T22:49:27.999Z]
[2025-06-19T22:49:27.999Z] "Thread-277" #287 prio=5 os_prio=0 cpu=0.00ms elapsed=0.85s tid=0x27edb800 nid=0x6ce8 runnable [0x00000000]
[2025-06-19T22:49:27.999Z] java.lang.Thread.State: TERMINATED
[2025-06-19T22:49:27.999Z]
[2025-06-19T22:49:27.999Z] "Thread-278" #288 prio=5 os_prio=0 cpu=0.00ms elapsed=0.85s tid=0x27ee0800 nid=0x52fc runnable [0x00000000]
[2025-06-19T22:49:27.999Z] java.lang.Thread.State: TERMINATED
[2025-06-19T22:49:27.999Z]
[2025-06-19T22:49:27.999Z] "Thread-279" #289 prio=5 os_prio=0 cpu=0.00ms elapsed=0.85s tid=0x27edd400 nid=0xb1d0 runnable [0x00000000]
[2025-06-19T22:49:27.999Z] java.lang.Thread.State: TERMINATED
[2025-06-19T22:49:27.999Z]
[2025-06-19T22:49:27.999Z] "Thread-281" #291 prio=5 os_prio=0 cpu=0.00ms elapsed=0.85s tid=0x27ee1800 nid=0x4f7c runnable [0x00000000]
[2025-06-19T22:49:27.999Z] java.lang.Thread.State: TERMINATED
[2025-06-19T22:49:27.999Z]
[2025-06-19T22:49:28.000Z] "Thread-282" #292 prio=5 os_prio=0 cpu=0.00ms elapsed=0.85s tid=0x27eddc00 nid=0x3928 runnable [0x00000000]
[2025-06-19T22:49:28.000Z] java.lang.Thread.State: TERMINATED
[2025-06-19T22:49:28.000Z]
[2025-06-19T22:49:28.000Z] "Thread-283" #293 prio=5 os_prio=0 cpu=0.00ms elapsed=0.85s tid=0x27edc000 nid=0x7f94 runnable [0x00000000]
[2025-06-19T22:49:28.000Z] java.lang.Thread.State: TERMINATED
[2025-06-19T22:49:28.000Z]
[2025-06-19T22:49:28.000Z] "Thread-285" #295 prio=5 os_prio=0 cpu=0.00ms elapsed=0.85s tid=0x27edc800 nid=0x4df4 runnable [0x00000000]
[2025-06-19T22:49:28.000Z] java.lang.Thread.State: TERMINATED
[2025-06-19T22:49:28.000Z]
[2025-06-19T22:49:28.000Z] "Thread-286" #296 prio=5 os_prio=0 cpu=0.00ms elapsed=0.85s tid=0x27edf400 nid=0xc61c runnable [0x00000000]
[2025-06-19T22:49:28.000Z] java.lang.Thread.State: TERMINATED
[2025-06-19T22:49:28.000Z]
[2025-06-19T22:49:28.000Z] "Thread-287" #297 prio=5 os_prio=0 cpu=0.00ms elapsed=0.85s tid=0x27edec00 nid=0x2ea0 runnable [0x00000000]
[2025-06-19T22:49:28.000Z] java.lang.Thread.State: TERMINATED
[2025-06-19T22:49:28.000Z]
[2025-06-19T22:49:28.000Z] "Thread-289" #299 prio=5 os_prio=0 cpu=0.00ms elapsed=0.85s tid=0x27edcc00 nid=0x5f2c runnable [0x00000000]
[2025-06-19T22:49:28.000Z] java.lang.Thread.State: TERMINATED
[2025-06-19T22:49:28.000Z]
[2025-06-19T22:49:28.000Z] "Thread-291" #301 prio=5 os_prio=0 cpu=0.00ms elapsed=0.85s tid=0x27ee2000 nid=0x1388 runnable [0x00000000]
[2025-06-19T22:49:28.000Z] java.lang.Thread.State: TERMINATED
[2025-06-19T22:49:28.000Z]
[2025-06-19T22:49:28.000Z] "Thread-293" #303 prio=5 os_prio=0 cpu=0.00ms elapsed=0.85s tid=0x27ee2c00 nid=0x26c4 runnable [0x00000000]
[2025-06-19T22:49:28.000Z] java.lang.Thread.State: TERMINATED
[2025-06-19T22:49:28.000Z]
[2025-06-19T22:49:28.000Z] "Thread-295" #305 prio=5 os_prio=0 cpu=0.00ms elapsed=0.85s tid=0x27f18000 nid=0xb49c runnable [0x00000000]
[2025-06-19T22:49:28.000Z] java.lang.Thread.State: TERMINATED
[2025-06-19T22:49:28.000Z]
[2025-06-19T22:49:28.000Z] "Thread-296" #306 prio=5 os_prio=0 cpu=0.00ms elapsed=0.85s tid=0x27f15400 nid=0xa870 runnable [0x00000000]
[2025-06-19T22:49:28.000Z] java.lang.Thread.State: TERMINATED
[2025-06-19T22:49:28.000Z]
[2025-06-19T22:49:28.000Z] "Thread-297" #307 prio=5 os_prio=0 cpu=0.00ms elapsed=0.85s tid=0x27f18800 nid=0xd518 runnable [0x00000000]
[2025-06-19T22:49:28.000Z] java.lang.Thread.State: TERMINATED
[2025-06-19T22:49:28.000Z]
[2025-06-19T22:49:28.000Z] "Thread-298" #308 prio=5 os_prio=0 cpu=0.00ms elapsed=0.85s tid=0x27f14400 nid=0x9e34 runnable [0x00000000]
[2025-06-19T22:49:28.000Z] java.lang.Thread.State: TERMINATED
[2025-06-19T22:49:28.000Z]
[2025-06-19T22:49:28.000Z] "Thread-300" #310 prio=5 os_prio=0 cpu=0.00ms elapsed=0.85s tid=0x27f18c00 nid=0xcf70 runnable [0x00000000]
[2025-06-19T22:49:28.000Z] java.lang.Thread.State: TERMINATED
[2025-06-19T22:49:28.000Z]
[2025-06-19T22:49:28.000Z] "Thread-304" #314 prio=5 os_prio=0 cpu=0.00ms elapsed=0.85s tid=0x27f17800 nid=0xbc54 runnable [0x00000000]
[2025-06-19T22:49:28.000Z] java.lang.Thread.State: TERMINATED
[2025-06-19T22:49:28.000Z]
[2025-06-19T22:49:28.000Z] "Thread-305" #315 prio=5 os_prio=0 cpu=0.00ms elapsed=0.85s tid=0x27f13800 nid=0xf0d8 runnable [0x00000000]
[2025-06-19T22:49:28.000Z] java.lang.Thread.State: TERMINATED
[2025-06-19T22:49:28.000Z]
[2025-06-19T22:49:28.000Z] "Thread-306" #316 prio=5 os_prio=0 cpu=0.00ms elapsed=0.85s tid=0x27f19400 nid=0xcb10 runnable [0x00000000]
[2025-06-19T22:49:28.000Z] java.lang.Thread.State: TERMINATED
[2025-06-19T22:49:28.000Z]
[2025-06-19T22:49:28.000Z] "Thread-308" #318 prio=5 os_prio=0 cpu=0.00ms elapsed=0.85s tid=0x27f13000 nid=0x7f48 runnable [0x00000000]
[2025-06-19T22:49:28.000Z] java.lang.Thread.State: TERMINATED
[2025-06-19T22:49:28.000Z]
[2025-06-19T22:49:28.000Z] "Thread-309" #319 prio=5 os_prio=0 cpu=0.00ms elapsed=0.85s tid=0x27f13c00 nid=0xe3f4 runnable [0x00000000]
[2025-06-19T22:49:28.000Z] java.lang.Thread.State: TERMINATED
[2025-06-19T22:49:28.000Z]
[2025-06-19T22:49:28.000Z] "Thread-310" #320 prio=5 os_prio=0 cpu=0.00ms elapsed=0.85s tid=0x27f1ac00 nid=0x6798 runnable [0x00000000]
[2025-06-19T22:49:28.000Z] java.lang.Thread.State: TERMINATED
[2025-06-19T22:49:28.000Z]
[2025-06-19T22:49:28.000Z] "Thread-312" #322 prio=5 os_prio=0 cpu=0.00ms elapsed=0.85s tid=0x27f1b000 nid=0x4a10 runnable [0x00000000]
[2025-06-19T22:49:28.000Z] java.lang.Thread.State: TERMINATED
[2025-06-19T22:49:28.000Z]
[2025-06-19T22:49:28.000Z] "Thread-314" #324 prio=5 os_prio=0 cpu=0.00ms elapsed=0.85s tid=0x27f14c00 nid=0xfec0 runnable [0x00000000]
[2025-06-19T22:49:28.000Z] java.lang.Thread.State: TERMINATED
[2025-06-19T22:49:28.000Z]
[2025-06-19T22:49:28.000Z] "Thread-315" #325 prio=5 os_prio=0 cpu=0.00ms elapsed=0.85s tid=0x27f1e400 nid=0xa03c runnable [0x00000000]
[2025-06-19T22:49:28.000Z] java.lang.Thread.State: TERMINATED
[2025-06-19T22:49:28.000Z]
[2025-06-19T22:49:28.000Z] "Thread-316" #326 prio=5 os_prio=0 cpu=0.00ms elapsed=0.85s tid=0x27f1d800 nid=0x9718 runnable [0x00000000]
[2025-06-19T22:49:28.000Z] java.lang.Thread.State: TERMINATED
[2025-06-19T22:49:28.000Z]
[2025-06-19T22:49:28.000Z] "Thread-319" #329 prio=5 os_prio=0 cpu=0.00ms elapsed=0.85s tid=0x27f1c000 nid=0xd7b8 runnable [0x00000000]
[2025-06-19T22:49:28.000Z] java.lang.Thread.State: TERMINATED
[2025-06-19T22:49:28.000Z]
[2025-06-19T22:49:28.000Z] "Thread-321" #331 prio=5 os_prio=0 cpu=0.00ms elapsed=0.85s tid=0x27f1c800 nid=0x47a4 runnable [0x00000000]
[2025-06-19T22:49:28.000Z] java.lang.Thread.State: TERMINATED
[2025-06-19T22:49:28.000Z]
[2025-06-19T22:49:28.000Z] "Thread-322" #332 prio=5 os_prio=0 cpu=0.00ms elapsed=0.85s tid=0x27f1d000 nid=0xb1f0 runnable [0x00000000]
[2025-06-19T22:49:28.000Z] java.lang.Thread.State: TERMINATED
[2025-06-19T22:49:28.000Z]
[2025-06-19T22:49:28.000Z] "Thread-323" #333 prio=5 os_prio=0 cpu=0.00ms elapsed=0.85s tid=0x27f1dc00 nid=0xf22c runnable [0x00000000]
[2025-06-19T22:49:28.000Z] java.lang.Thread.State: TERMINATED
[2025-06-19T22:49:28.000Z]
[2025-06-19T22:49:28.000Z] "Thread-324" #334 prio=5 os_prio=0 cpu=0.00ms elapsed=0.85s tid=0x27f20400 nid=0x7cf0 runnable [0x00000000]
[2025-06-19T22:49:28.000Z] java.lang.Thread.State: TERMINATED
[2025-06-19T22:49:28.000Z]
[2025-06-19T22:49:28.000Z] "Thread-325" #335 prio=5 os_prio=0 cpu=0.00ms elapsed=0.85s tid=0x27f20800 nid=0x5e9c runnable [0x00000000]
[2025-06-19T22:49:28.000Z] java.lang.Thread.State: TERMINATED
[2025-06-19T22:49:28.000Z]
[2025-06-19T22:49:28.000Z] "Thread-327" #337 prio=5 os_prio=0 cpu=0.00ms elapsed=0.85s tid=0x27f21000 nid=0x5ce0 runnable [0x00000000]
[2025-06-19T22:49:28.000Z] java.lang.Thread.State: TERMINATED
[2025-06-19T22:49:28.000Z]
[2025-06-19T22:49:28.000Z] "Thread-332" #342 prio=5 os_prio=0 cpu=0.00ms elapsed=0.85s tid=0x27f3f400 nid=0x98c0 runnable [0x00000000]
[2025-06-19T22:49:28.000Z] java.lang.Thread.State: TERMINATED
[2025-06-19T22:49:28.000Z]
[2025-06-19T22:49:28.000Z] "Thread-334" #344 prio=5 os_prio=0 cpu=0.00ms elapsed=0.85s tid=0x27f3c800 nid=0xfb88 runnable [0x00000000]
[2025-06-19T22:49:28.000Z] java.lang.Thread.State: TERMINATED
[2025-06-19T22:49:28.000Z]
[2025-06-19T22:49:28.000Z] "Thread-335" #345 prio=5 os_prio=0 cpu=0.00ms elapsed=0.85s tid=0x27f42800 nid=0x10488 runnable [0x00000000]
[2025-06-19T22:49:28.000Z] java.lang.Thread.State: TERMINATED
[2025-06-19T22:49:28.000Z]
[2025-06-19T22:49:28.000Z] "Thread-336" #346 prio=5 os_prio=0 cpu=0.00ms elapsed=0.85s tid=0x27f41000 nid=0x7fd0 runnable [0x00000000]
[2025-06-19T22:49:28.000Z] java.lang.Thread.State: TERMINATED
[2025-06-19T22:49:28.000Z]
[2025-06-19T22:49:28.000Z] "Thread-337" #347 prio=5 os_prio=0 cpu=0.00ms elapsed=0.85s tid=0x27f41800 nid=0x31e0 runnable [0x00000000]
[2025-06-19T22:49:28.000Z] java.lang.Thread.State: TERMINATED
[2025-06-19T22:49:28.000Z]
[2025-06-19T22:49:28.000Z] "Thread-339" #349 prio=5 os_prio=0 cpu=0.00ms elapsed=0.85s tid=0x27f42000 nid=0x4144 runnable [0x00000000]
[2025-06-19T22:49:28.000Z] java.lang.Thread.State: TERMINATED
[2025-06-19T22:49:28.000Z]
[2025-06-19T22:49:28.000Z] "Thread-340" #350 prio=5 os_prio=0 cpu=0.00ms elapsed=0.85s tid=0x27f3dc00 nid=0x9ce4 runnable [0x00000000]
[2025-06-19T22:49:28.000Z] java.lang.Thread.State: TERMINATED
[2025-06-19T22:49:28.000Z]
[2025-06-19T22:49:28.000Z] "Thread-341" #351 prio=5 os_prio=0 cpu=0.00ms elapsed=0.85s tid=0x27f3ec00 nid=0xb888 runnable [0x00000000]
[2025-06-19T22:49:28.000Z] java.lang.Thread.State: TERMINATED
[2025-06-19T22:49:28.000Z]
[2025-06-19T22:49:28.000Z] "Thread-343" #353 prio=5 os_prio=0 cpu=0.00ms elapsed=0.85s tid=0x27f40000 nid=0xd254 runnable [0x00000000]
[2025-06-19T22:49:28.000Z] java.lang.Thread.State: TERMINATED
[2025-06-19T22:49:28.000Z]
[2025-06-19T22:49:28.000Z] "Thread-344" #354 prio=5 os_prio=0 cpu=0.00ms elapsed=0.85s tid=0x27f43c00 nid=0xf11c runnable [0x00000000]
[2025-06-19T22:49:28.000Z] java.lang.Thread.State: TERMINATED
[2025-06-19T22:49:28.000Z]
[2025-06-19T22:49:28.000Z] "Thread-346" #356 prio=5 os_prio=0 cpu=0.00ms elapsed=0.85s tid=0x27f43400 nid=0xa7f8 runnable [0x00000000]
[2025-06-19T22:49:28.000Z] java.lang.Thread.State: TERMINATED
[2025-06-19T22:49:28.000Z]
[2025-06-19T22:49:28.000Z] "Thread-347" #357 prio=5 os_prio=0 cpu=0.00ms elapsed=0.85s tid=0x27f3e400 nid=0x1a08 runnable [0x00000000]
[2025-06-19T22:49:28.000Z] java.lang.Thread.State: TERMINATED
[2025-06-19T22:49:28.000Z]
[2025-06-19T22:49:28.000Z] "Thread-348" #358 prio=5 os_prio=0 cpu=0.00ms elapsed=0.85s tid=0x27f3d000 nid=0xc218 runnable [0x00000000]
[2025-06-19T22:49:28.000Z] java.lang.Thread.State: TERMINATED
[2025-06-19T22:49:28.000Z]
[2025-06-19T22:49:28.000Z] "Thread-349" #359 prio=5 os_prio=0 cpu=0.00ms elapsed=0.85s tid=0x27f46000 nid=0x8290 runnable [0x00000000]
[2025-06-19T22:49:28.000Z] java.lang.Thread.State: TERMINATED
[2025-06-19T22:49:28.000Z]
[2025-06-19T22:49:28.000Z] "Thread-350" #360 prio=5 os_prio=0 cpu=0.00ms elapsed=0.85s tid=0x27f48400 nid=0x8918 runnable [0x00000000]
[2025-06-19T22:49:28.000Z] java.lang.Thread.State: TERMINATED
[2025-06-19T22:49:28.000Z]
[2025-06-19T22:49:28.000Z] "Thread-351" #361 prio=5 os_prio=0 cpu=0.00ms elapsed=0.85s tid=0x27f44400 nid=0x5748 runnable [0x00000000]
[2025-06-19T22:49:28.000Z] java.lang.Thread.State: TERMINATED
[2025-06-19T22:49:28.000Z]
[2025-06-19T22:49:28.001Z] "Thread-352" #362 prio=5 os_prio=0 cpu=0.00ms elapsed=0.85s tid=0x27f49400 nid=0x598c runnable [0x00000000]
[2025-06-19T22:49:28.001Z] java.lang.Thread.State: TERMINATED
[2025-06-19T22:49:28.001Z]
[2025-06-19T22:49:28.001Z] "Thread-353" #363 prio=5 os_prio=0 cpu=0.00ms elapsed=0.85s tid=0x27f48c00 nid=0x6414 runnable [0x00000000]
[2025-06-19T22:49:28.001Z] java.lang.Thread.State: TERMINATED
[2025-06-19T22:49:28.001Z]
[2025-06-19T22:49:28.001Z] "Thread-355" #365 prio=5 os_prio=0 cpu=0.00ms elapsed=0.85s tid=0x27f45000 nid=0xf5a4 runnable [0x00000000]
[2025-06-19T22:49:28.001Z] java.lang.Thread.State: TERMINATED
[2025-06-19T22:49:28.001Z]
[2025-06-19T22:49:28.001Z] "Thread-356" #366 prio=5 os_prio=0 cpu=0.00ms elapsed=0.85s tid=0x27f45800 nid=0xc8d0 runnable [0x00000000]
[2025-06-19T22:49:28.001Z] java.lang.Thread.State: TERMINATED
[2025-06-19T22:49:28.001Z]
[2025-06-19T22:49:28.001Z] "Thread-357" #367 prio=5 os_prio=0 cpu=0.00ms elapsed=0.85s tid=0x27f46800 nid=0xcc58 runnable [0x00000000]
[2025-06-19T22:49:28.001Z] java.lang.Thread.State: TERMINATED
[2025-06-19T22:49:28.001Z]
[2025-06-19T22:49:28.001Z] "Thread-359" #369 prio=5 os_prio=0 cpu=0.00ms elapsed=0.85s tid=0x27f47c00 nid=0x33ac runnable [0x00000000]
[2025-06-19T22:49:28.001Z] java.lang.Thread.State: TERMINATED
[2025-06-19T22:49:28.001Z]
[2025-06-19T22:49:28.001Z] "Thread-360" #370 prio=5 os_prio=0 cpu=0.00ms elapsed=0.85s tid=0x27f47800 nid=0x14c4 runnable [0x00000000]
[2025-06-19T22:49:28.001Z] java.lang.Thread.State: TERMINATED
[2025-06-19T22:49:28.001Z]
[2025-06-19T22:49:28.001Z] "Thread-361" #371 prio=5 os_prio=0 cpu=0.00ms elapsed=0.85s tid=0x27f4ec00 nid=0xf7d8 runnable [0x00000000]
[2025-06-19T22:49:28.001Z] java.lang.Thread.State: TERMINATED
[2025-06-19T22:49:28.001Z]
[2025-06-19T22:49:28.001Z] "Thread-364" #374 prio=5 os_prio=0 cpu=0.00ms elapsed=0.85s tid=0x27f50000 nid=0x4890 runnable [0x00000000]
[2025-06-19T22:49:28.001Z] java.lang.Thread.State: TERMINATED
[2025-06-19T22:49:28.001Z]
[2025-06-19T22:49:28.001Z] "Thread-365" #375 prio=5 os_prio=0 cpu=0.00ms elapsed=0.85s tid=0x27f50800 nid=0x5d38 runnable [0x00000000]
[2025-06-19T22:49:28.001Z] java.lang.Thread.State: TERMINATED
[2025-06-19T22:49:28.001Z]
[2025-06-19T22:49:28.001Z] "Thread-366" #376 prio=5 os_prio=0 cpu=0.00ms elapsed=0.85s tid=0x27f4c000 nid=0xbdf4 runnable [0x00000000]
[2025-06-19T22:49:28.001Z] java.lang.Thread.State: TERMINATED
[2025-06-19T22:49:28.001Z]
[2025-06-19T22:49:28.001Z] "Thread-368" #378 prio=5 os_prio=0 cpu=0.00ms elapsed=0.85s tid=0x27f4d400 nid=0x4a70 runnable [0x00000000]
[2025-06-19T22:49:28.001Z] java.lang.Thread.State: TERMINATED
[2025-06-19T22:49:28.001Z]
[2025-06-19T22:49:28.001Z] "Thread-369" #379 prio=5 os_prio=0 cpu=0.00ms elapsed=0.85s tid=0x27f4a800 nid=0x2104 runnable [0x00000000]
[2025-06-19T22:49:28.001Z] java.lang.Thread.State: TERMINATED
[2025-06-19T22:49:28.001Z]
[2025-06-19T22:49:28.001Z] "Thread-372" #382 prio=5 os_prio=0 cpu=0.00ms elapsed=0.85s tid=0x27f4a400 nid=0x8ad8 runnable [0x00000000]
[2025-06-19T22:49:28.001Z] java.lang.Thread.State: TERMINATED
[2025-06-19T22:49:28.001Z]
[2025-06-19T22:49:28.001Z] "Thread-373" #383 prio=5 os_prio=0 cpu=0.00ms elapsed=0.85s tid=0x27f51000 nid=0xeed0 runnable [0x00000000]
[2025-06-19T22:49:28.001Z] java.lang.Thread.State: TERMINATED
[2025-06-19T22:49:28.001Z]
[2025-06-19T22:49:28.001Z] "Thread-375" #385 prio=5 os_prio=0 cpu=0.00ms elapsed=0.85s tid=0x27f51800 nid=0x7f34 runnable [0x00000000]
[2025-06-19T22:49:28.001Z] java.lang.Thread.State: TERMINATED
[2025-06-19T22:49:28.001Z]
[2025-06-19T22:49:28.001Z] "Thread-376" #386 prio=5 os_prio=0 cpu=0.00ms elapsed=0.85s tid=0x27f4b800 nid=0x7488 runnable [0x00000000]
[2025-06-19T22:49:28.001Z] java.lang.Thread.State: TERMINATED
[2025-06-19T22:49:28.001Z]
[2025-06-19T22:49:28.001Z] "Thread-378" #388 prio=5 os_prio=0 cpu=0.00ms elapsed=0.85s tid=0x27f51c00 nid=0x10580 runnable [0x00000000]
[2025-06-19T22:49:28.001Z] java.lang.Thread.State: TERMINATED
[2025-06-19T22:49:28.001Z]
[2025-06-19T22:49:28.001Z] "Thread-379" #389 prio=5 os_prio=0 cpu=0.00ms elapsed=0.85s tid=0x27f4b000 nid=0x5e90 runnable [0x00000000]
[2025-06-19T22:49:28.001Z] java.lang.Thread.State: TERMINATED
[2025-06-19T22:49:28.001Z]
[2025-06-19T22:49:28.001Z] "Thread-380" #390 prio=5 os_prio=0 cpu=0.00ms elapsed=0.85s tid=0x27f54800 nid=0x7ba0 runnable [0x00000000]
[2025-06-19T22:49:28.001Z] java.lang.Thread.State: TERMINATED
[2025-06-19T22:49:28.001Z]
[2025-06-19T22:49:28.001Z] "Thread-382" #392 prio=5 os_prio=0 cpu=0.00ms elapsed=0.85s tid=0x27f55000 nid=0x1638 runnable [0x00000000]
[2025-06-19T22:49:28.001Z] java.lang.Thread.State: TERMINATED
[2025-06-19T22:49:28.001Z]
[2025-06-19T22:49:28.001Z] "Thread-383" #393 prio=5 os_prio=0 cpu=0.00ms elapsed=0.85s tid=0x27f52400 nid=0xf914 runnable [0x00000000]
[2025-06-19T22:49:28.001Z] java.lang.Thread.State: TERMINATED
[2025-06-19T22:49:28.001Z]
[2025-06-19T22:49:28.001Z] "Thread-387" #397 prio=5 os_prio=0 cpu=0.00ms elapsed=0.85s tid=0x27f52c00 nid=0x18e8 runnable [0x00000000]
[2025-06-19T22:49:28.001Z] java.lang.Thread.State: TERMINATED
[2025-06-19T22:49:28.001Z]
[2025-06-19T22:49:28.001Z] "Thread-390" #400 prio=5 os_prio=0 cpu=0.00ms elapsed=0.85s tid=0x27f53c00 nid=0xe64c runnable [0x00000000]
[2025-06-19T22:49:28.001Z] java.lang.Thread.State: TERMINATED
[2025-06-19T22:49:28.001Z]
[2025-06-19T22:49:28.001Z] "Thread-391" #401 prio=5 os_prio=0 cpu=0.00ms elapsed=0.85s tid=0x27f54400 nid=0x9b28 runnable [0x00000000]
[2025-06-19T22:49:28.001Z] java.lang.Thread.State: TERMINATED
[2025-06-19T22:49:28.001Z]
[2025-06-19T22:49:28.001Z] "Thread-394" #404 prio=5 os_prio=0 cpu=0.00ms elapsed=0.85s tid=0x27f59400 nid=0xdfc0 runnable [0x00000000]
[2025-06-19T22:49:28.001Z] java.lang.Thread.State: TERMINATED
[2025-06-19T22:49:28.001Z]
[2025-06-19T22:49:28.001Z] "Thread-395" #405 prio=5 os_prio=0 cpu=0.00ms elapsed=0.85s tid=0x27f59800 nid=0x7788 runnable [0x00000000]
[2025-06-19T22:49:28.001Z] java.lang.Thread.State: TERMINATED
[2025-06-19T22:49:28.001Z]
[2025-06-19T22:49:28.001Z] "Thread-396" #406 prio=5 os_prio=0 cpu=0.00ms elapsed=0.85s tid=0x27f58400 nid=0x7ddc runnable [0x00000000]
[2025-06-19T22:49:28.001Z] java.lang.Thread.State: TERMINATED
[2025-06-19T22:49:28.001Z]
[2025-06-19T22:49:28.001Z] "Thread-397" #407 prio=5 os_prio=0 cpu=0.00ms elapsed=0.85s tid=0x27f58c00 nid=0x981c runnable [0x00000000]
[2025-06-19T22:49:28.001Z] java.lang.Thread.State: TERMINATED
[2025-06-19T22:49:28.001Z]
[2025-06-19T22:49:28.001Z] "Thread-398" #408 prio=5 os_prio=0 cpu=0.00ms elapsed=0.85s tid=0x27f5a000 nid=0xf658 runnable [0x00000000]
[2025-06-19T22:49:28.001Z] java.lang.Thread.State: TERMINATED
[2025-06-19T22:49:28.001Z]
[2025-06-19T22:49:28.001Z] "Thread-399" #409 prio=5 os_prio=0 cpu=0.00ms elapsed=0.85s tid=0x27fb5800 nid=0x2ec0 runnable [0x00000000]
[2025-06-19T22:49:28.001Z] java.lang.Thread.State: TERMINATED
[2025-06-19T22:49:28.001Z]
[2025-06-19T22:49:28.001Z] "Thread-400" #410 prio=5 os_prio=0 cpu=0.00ms elapsed=0.85s tid=0x27fb2c00 nid=0x517c runnable [0x00000000]
[2025-06-19T22:49:28.001Z] java.lang.Thread.State: TERMINATED
[2025-06-19T22:49:28.001Z]
[2025-06-19T22:49:28.001Z] "Thread-402" #412 prio=5 os_prio=0 cpu=0.00ms elapsed=0.85s tid=0x27fb1400 nid=0x39c0 runnable [0x00000000]
[2025-06-19T22:49:28.001Z] java.lang.Thread.State: TERMINATED
[2025-06-19T22:49:28.001Z]
[2025-06-19T22:49:28.001Z] "Thread-403" #413 prio=5 os_prio=0 cpu=0.00ms elapsed=0.85s tid=0x27fb4800 nid=0xcbfc runnable [0x00000000]
[2025-06-19T22:49:28.001Z] java.lang.Thread.State: TERMINATED
[2025-06-19T22:49:28.001Z]
[2025-06-19T22:49:28.001Z] "Thread-406" #416 prio=5 os_prio=0 cpu=0.00ms elapsed=0.85s tid=0x27fb3800 nid=0xa6b0 runnable [0x00000000]
[2025-06-19T22:49:28.001Z] java.lang.Thread.State: TERMINATED
[2025-06-19T22:49:28.001Z]
[2025-06-19T22:49:28.001Z] "Thread-407" #417 prio=5 os_prio=0 cpu=0.00ms elapsed=0.85s tid=0x27fb5000 nid=0x8d54 runnable [0x00000000]
[2025-06-19T22:49:28.001Z] java.lang.Thread.State: TERMINATED
[2025-06-19T22:49:28.001Z]
[2025-06-19T22:49:28.001Z] "Thread-408" #418 prio=5 os_prio=0 cpu=0.00ms elapsed=0.85s tid=0x27faf800 nid=0x1960 runnable [0x00000000]
[2025-06-19T22:49:28.001Z] java.lang.Thread.State: TERMINATED
[2025-06-19T22:49:28.001Z]
[2025-06-19T22:49:28.001Z] "Thread-409" #419 prio=5 os_prio=0 cpu=0.00ms elapsed=0.85s tid=0x27fb4000 nid=0xb478 runnable [0x00000000]
[2025-06-19T22:49:28.001Z] java.lang.Thread.State: TERMINATED
[2025-06-19T22:49:28.001Z]
[2025-06-19T22:49:28.001Z] "Thread-410" #420 prio=5 os_prio=0 cpu=0.00ms elapsed=0.85s tid=0x27fb6c00 nid=0xad64 runnable [0x00000000]
[2025-06-19T22:49:28.001Z] java.lang.Thread.State: TERMINATED
[2025-06-19T22:49:28.001Z]
[2025-06-19T22:49:28.001Z] "Thread-412" #422 prio=5 os_prio=0 cpu=0.00ms elapsed=0.85s tid=0x27fb0000 nid=0x90f4 runnable [0x00000000]
[2025-06-19T22:49:28.001Z] java.lang.Thread.State: TERMINATED
[2025-06-19T22:49:28.001Z]
[2025-06-19T22:49:28.001Z] "Thread-413" #423 prio=5 os_prio=0 cpu=0.00ms elapsed=0.85s tid=0x27fb7400 nid=0xf4bc runnable [0x00000000]
[2025-06-19T22:49:28.001Z] java.lang.Thread.State: TERMINATED
[2025-06-19T22:49:28.001Z]
[2025-06-19T22:49:28.001Z] "Thread-414" #424 prio=5 os_prio=0 cpu=0.00ms elapsed=0.85s tid=0x27fb0800 nid=0xca74 runnable [0x00000000]
[2025-06-19T22:49:28.001Z] java.lang.Thread.State: TERMINATED
[2025-06-19T22:49:28.001Z]
[2025-06-19T22:49:28.001Z] "Thread-416" #426 prio=5 os_prio=0 cpu=0.00ms elapsed=0.85s tid=0x27fb1c00 nid=0x6788 runnable [0x00000000]
[2025-06-19T22:49:28.001Z] java.lang.Thread.State: TERMINATED
[2025-06-19T22:49:28.001Z]
[2025-06-19T22:49:28.001Z] "Thread-418" #428 prio=5 os_prio=0 cpu=0.00ms elapsed=0.85s tid=0x27fb9000 nid=0xc234 runnable [0x00000000]
[2025-06-19T22:49:28.001Z] java.lang.Thread.State: TERMINATED
[2025-06-19T22:49:28.001Z]
[2025-06-19T22:49:28.001Z] "Thread-420" #430 prio=5 os_prio=0 cpu=0.00ms elapsed=0.85s tid=0x27fbdc00 nid=0xc598 runnable [0x00000000]
[2025-06-19T22:49:28.001Z] java.lang.Thread.State: TERMINATED
[2025-06-19T22:49:28.001Z]
[2025-06-19T22:49:28.001Z] "Thread-422" #432 prio=5 os_prio=0 cpu=0.00ms elapsed=0.85s tid=0x27fb8400 nid=0xd6d0 runnable [0x00000000]
[2025-06-19T22:49:28.001Z] java.lang.Thread.State: TERMINATED
[2025-06-19T22:49:28.001Z]
[2025-06-19T22:49:28.001Z] "Thread-423" #433 prio=5 os_prio=0 cpu=0.00ms elapsed=0.85s tid=0x27fba000 nid=0xf8c4 runnable [0x00000000]
[2025-06-19T22:49:28.001Z] java.lang.Thread.State: TERMINATED
[2025-06-19T22:49:28.001Z]
[2025-06-19T22:49:28.002Z] "Thread-425" #435 prio=5 os_prio=0 cpu=0.00ms elapsed=0.85s tid=0x27fbb400 nid=0x3c68 runnable [0x00000000]
[2025-06-19T22:49:28.002Z] java.lang.Thread.State: TERMINATED
[2025-06-19T22:49:28.002Z]
[2025-06-19T22:49:28.002Z] "Thread-427" #437 prio=5 os_prio=0 cpu=0.00ms elapsed=0.85s tid=0x27fba800 nid=0xdc1c runnable [0x00000000]
[2025-06-19T22:49:28.002Z] java.lang.Thread.State: TERMINATED
[2025-06-19T22:49:28.002Z]
[2025-06-19T22:49:28.002Z] "Thread-428" #438 prio=5 os_prio=0 cpu=0.00ms elapsed=0.85s tid=0x27fbc400 nid=0x56fc runnable [0x00000000]
[2025-06-19T22:49:28.002Z] java.lang.Thread.State: TERMINATED
[2025-06-19T22:49:28.002Z]
[2025-06-19T22:49:28.002Z] "Thread-430" #440 prio=5 os_prio=0 cpu=0.00ms elapsed=0.85s tid=0x27fbb000 nid=0xc20c runnable [0x00000000]
[2025-06-19T22:49:28.002Z] java.lang.Thread.State: TERMINATED
[2025-06-19T22:49:28.002Z]
[2025-06-19T22:49:28.002Z] "Thread-431" #441 prio=5 os_prio=0 cpu=0.00ms elapsed=0.85s tid=0x27fc0000 nid=0xf9bc runnable [0x00000000]
[2025-06-19T22:49:28.002Z] java.lang.Thread.State: TERMINATED
[2025-06-19T22:49:28.002Z]
[2025-06-19T22:49:28.002Z] "Thread-432" #442 prio=5 os_prio=0 cpu=0.00ms elapsed=0.85s tid=0x27fbf800 nid=0x46e0 runnable [0x00000000]
[2025-06-19T22:49:28.002Z] java.lang.Thread.State: TERMINATED
[2025-06-19T22:49:28.002Z]
[2025-06-19T22:49:28.002Z] "Thread-433" #443 prio=5 os_prio=0 cpu=0.00ms elapsed=0.85s tid=0x27fc0400 nid=0x6e50 runnable [0x00000000]
[2025-06-19T22:49:28.002Z] java.lang.Thread.State: TERMINATED
[2025-06-19T22:49:28.002Z]
[2025-06-19T22:49:28.002Z] "Thread-434" #444 prio=5 os_prio=0 cpu=0.00ms elapsed=0.85s tid=0x27fbe000 nid=0xb5e4 runnable [0x00000000]
[2025-06-19T22:49:28.002Z] java.lang.Thread.State: TERMINATED
[2025-06-19T22:49:28.002Z]
[2025-06-19T22:49:28.002Z] "Thread-435" #445 prio=5 os_prio=0 cpu=0.00ms elapsed=0.85s tid=0x27fbe800 nid=0x103a0 runnable [0x00000000]
[2025-06-19T22:49:28.002Z] java.lang.Thread.State: TERMINATED
[2025-06-19T22:49:28.002Z]
[2025-06-19T22:49:28.002Z] "Thread-437" #447 prio=5 os_prio=0 cpu=0.00ms elapsed=0.85s tid=0x27fa3400 nid=0xe9e0 runnable [0x00000000]
[2025-06-19T22:49:28.002Z] java.lang.Thread.State: TERMINATED
[2025-06-19T22:49:28.002Z]
[2025-06-19T22:49:28.002Z] "Thread-439" #449 prio=5 os_prio=0 cpu=0.00ms elapsed=0.85s tid=0x27fa3c00 nid=0xc6e4 runnable [0x00000000]
[2025-06-19T22:49:28.002Z] java.lang.Thread.State: TERMINATED
[2025-06-19T22:49:28.002Z]
[2025-06-19T22:49:28.002Z] "Thread-441" #451 prio=5 os_prio=0 cpu=0.00ms elapsed=0.85s tid=0x27fa5800 nid=0xcd98 runnable [0x00000000]
[2025-06-19T22:49:28.002Z] java.lang.Thread.State: TERMINATED
[2025-06-19T22:49:28.002Z]
[2025-06-19T22:49:28.002Z] "Thread-443" #453 prio=5 os_prio=0 cpu=0.00ms elapsed=0.85s tid=0x27fa7000 nid=0xe16c runnable [0x00000000]
[2025-06-19T22:49:28.002Z] java.lang.Thread.State: TERMINATED
[2025-06-19T22:49:28.002Z]
[2025-06-19T22:49:28.002Z] "Thread-444" #454 prio=5 os_prio=0 cpu=0.00ms elapsed=0.85s tid=0x27fa7c00 nid=0x3e18 runnable [0x00000000]
[2025-06-19T22:49:28.002Z] java.lang.Thread.State: TERMINATED
[2025-06-19T22:49:28.002Z]
[2025-06-19T22:49:28.002Z] "Thread-445" #455 prio=5 os_prio=0 cpu=0.00ms elapsed=0.85s tid=0x27fa6000 nid=0x3298 runnable [0x00000000]
[2025-06-19T22:49:28.002Z] java.lang.Thread.State: TERMINATED
[2025-06-19T22:49:28.003Z]
[2025-06-19T22:49:28.003Z] "Thread-447" #457 prio=5 os_prio=0 cpu=0.00ms elapsed=0.85s tid=0x27fa2c00 nid=0x4b10 runnable [0x00000000]
[2025-06-19T22:49:28.003Z] java.lang.Thread.State: TERMINATED
[2025-06-19T22:49:28.003Z]
[2025-06-19T22:49:28.003Z] "Thread-448" #458 prio=5 os_prio=0 cpu=0.00ms elapsed=0.85s tid=0x27fa1800 nid=0x853c runnable [0x00000000]
[2025-06-19T22:49:28.003Z] java.lang.Thread.State: TERMINATED
[2025-06-19T22:49:28.003Z]
[2025-06-19T22:49:28.003Z] "Thread-449" #459 prio=5 os_prio=0 cpu=0.00ms elapsed=0.85s tid=0x27fa1000 nid=0x3c4c runnable [0x00000000]
[2025-06-19T22:49:28.003Z] java.lang.Thread.State: TERMINATED
[2025-06-19T22:49:28.003Z]
[2025-06-19T22:49:28.003Z] "Thread-451" #461 prio=5 os_prio=0 cpu=0.00ms elapsed=0.85s tid=0x27fa8400 nid=0x2bb4 runnable [0x00000000]
[2025-06-19T22:49:28.003Z] java.lang.Thread.State: TERMINATED
[2025-06-19T22:49:28.003Z]
[2025-06-19T22:49:28.003Z] "Thread-452" #462 prio=5 os_prio=0 cpu=0.00ms elapsed=0.85s tid=0x27fa1c00 nid=0x9fe8 runnable [0x00000000]
[2025-06-19T22:49:28.003Z] java.lang.Thread.State: TERMINATED
[2025-06-19T22:49:28.003Z]
[2025-06-19T22:49:28.003Z] "Thread-453" #463 prio=5 os_prio=0 cpu=0.00ms elapsed=0.85s tid=0x27fa8c00 nid=0xc248 runnable [0x00000000]
[2025-06-19T22:49:28.003Z] java.lang.Thread.State: TERMINATED
[2025-06-19T22:49:28.003Z]
[2025-06-19T22:49:28.003Z] "Thread-455" #465 prio=5 os_prio=0 cpu=0.00ms elapsed=0.85s tid=0x27fa2400 nid=0xf114 runnable [0x00000000]
[2025-06-19T22:49:28.004Z] java.lang.Thread.State: TERMINATED
[2025-06-19T22:49:28.004Z]
[2025-06-19T22:49:28.004Z] "Thread-456" #466 prio=5 os_prio=0 cpu=0.00ms elapsed=0.85s tid=0x27faf000 nid=0xef68 runnable [0x00000000]
[2025-06-19T22:49:28.004Z] java.lang.Thread.State: TERMINATED
[2025-06-19T22:49:28.004Z]
[2025-06-19T22:49:28.004Z] "Thread-457" #467 prio=5 os_prio=0 cpu=0.00ms elapsed=0.85s tid=0x27fa9800 nid=0xef04 runnable [0x00000000]
[2025-06-19T22:49:28.004Z] java.lang.Thread.State: TERMINATED
[2025-06-19T22:49:28.004Z]
[2025-06-19T22:49:28.004Z] "Thread-459" #469 prio=5 os_prio=0 cpu=0.00ms elapsed=0.85s tid=0x27faa000 nid=0xe1a8 runnable [0x00000000]
[2025-06-19T22:49:28.004Z] java.lang.Thread.State: TERMINATED
[2025-06-19T22:49:28.004Z]
[2025-06-19T22:49:28.004Z] "Thread-461" #471 prio=5 os_prio=0 cpu=0.00ms elapsed=0.85s tid=0x27fadc00 nid=0x585c runnable [0x00000000]
[2025-06-19T22:49:28.004Z] java.lang.Thread.State: TERMINATED
[2025-06-19T22:49:28.004Z]
[2025-06-19T22:49:28.004Z] "Thread-464" #474 prio=5 os_prio=0 cpu=0.00ms elapsed=0.85s tid=0x27fac000 nid=0x5e28 runnable [0x00000000]
[2025-06-19T22:49:28.004Z] java.lang.Thread.State: TERMINATED
[2025-06-19T22:49:28.004Z]
[2025-06-19T22:49:28.004Z] "Thread-465" #475 prio=5 os_prio=0 cpu=0.00ms elapsed=0.85s tid=0x27fac400 nid=0xe28c runnable [0x00000000]
[2025-06-19T22:49:28.004Z] java.lang.Thread.State: TERMINATED
[2025-06-19T22:49:28.004Z]
[2025-06-19T22:49:28.004Z] "Thread-466" #476 prio=5 os_prio=0 cpu=0.00ms elapsed=0.85s tid=0x27facc00 nid=0x4c74 runnable [0x00000000]
[2025-06-19T22:49:28.004Z] java.lang.Thread.State: TERMINATED
[2025-06-19T22:49:28.004Z]
[2025-06-19T22:49:28.004Z] "Thread-467" #477 prio=5 os_prio=0 cpu=0.00ms elapsed=0.85s tid=0x27fae400 nid=0x191c runnable [0x00000000]
[2025-06-19T22:49:28.004Z] java.lang.Thread.State: TERMINATED
[2025-06-19T22:49:28.004Z]
[2025-06-19T22:49:28.004Z] "Thread-469" #479 prio=5 os_prio=0 cpu=0.00ms elapsed=0.84s tid=0x2801f800 nid=0x27a4 runnable [0x00000000]
[2025-06-19T22:49:28.004Z] java.lang.Thread.State: TERMINATED
[2025-06-19T22:49:28.004Z]
[2025-06-19T22:49:28.004Z] "Thread-470" #480 prio=5 os_prio=0 cpu=0.00ms elapsed=0.84s tid=0x28020c00 nid=0x71b4 runnable [0x00000000]
[2025-06-19T22:49:28.004Z] java.lang.Thread.State: TERMINATED
[2025-06-19T22:49:28.004Z]
[2025-06-19T22:49:28.004Z] "Thread-471" #481 prio=5 os_prio=0 cpu=0.00ms elapsed=0.84s tid=0x28021c00 nid=0x100f0 runnable [0x00000000]
[2025-06-19T22:49:28.004Z] java.lang.Thread.State: TERMINATED
[2025-06-19T22:49:28.004Z]
[2025-06-19T22:49:28.004Z] "Thread-473" #483 prio=5 os_prio=0 cpu=0.00ms elapsed=0.84s tid=0x28020800 nid=0x24e4 runnable [0x00000000]
[2025-06-19T22:49:28.004Z] java.lang.Thread.State: TERMINATED
[2025-06-19T22:49:28.004Z]
[2025-06-19T22:49:28.004Z] "Thread-475" #485 prio=5 os_prio=0 cpu=0.00ms elapsed=0.84s tid=0x28004400 nid=0xb230 runnable [0x00000000]
[2025-06-19T22:49:28.004Z] java.lang.Thread.State: TERMINATED
[2025-06-19T22:49:28.004Z]
[2025-06-19T22:49:28.004Z] "Thread-476" #486 prio=5 os_prio=0 cpu=0.00ms elapsed=0.84s tid=0x28003c00 nid=0x3de8 runnable [0x00000000]
[2025-06-19T22:49:28.004Z] java.lang.Thread.State: TERMINATED
[2025-06-19T22:49:28.004Z]
[2025-06-19T22:49:28.004Z] "Thread-478" #488 prio=5 os_prio=0 cpu=0.00ms elapsed=0.84s tid=0x28004800 nid=0x51bc runnable [0x00000000]
[2025-06-19T22:49:28.004Z] java.lang.Thread.State: TERMINATED
[2025-06-19T22:49:28.004Z]
[2025-06-19T22:49:28.004Z] "Thread-479" #489 prio=5 os_prio=0 cpu=0.00ms elapsed=0.84s tid=0x28005000 nid=0xea5c runnable [0x00000000]
[2025-06-19T22:49:28.004Z] java.lang.Thread.State: TERMINATED
[2025-06-19T22:49:28.004Z]
[2025-06-19T22:49:28.004Z] "Thread-480" #490 prio=5 os_prio=0 cpu=0.00ms elapsed=0.84s tid=0x28006800 nid=0xe534 runnable [0x00000000]
[2025-06-19T22:49:28.004Z] java.lang.Thread.State: TERMINATED
[2025-06-19T22:49:28.004Z]
[2025-06-19T22:49:28.004Z] "Thread-481" #491 prio=5 os_prio=0 cpu=0.00ms elapsed=0.84s tid=0x28005800 nid=0xd764 runnable [0x00000000]
[2025-06-19T22:49:28.004Z] java.lang.Thread.State: TERMINATED
[2025-06-19T22:49:28.004Z]
[2025-06-19T22:49:28.004Z] "Thread-482" #492 prio=5 os_prio=0 cpu=0.00ms elapsed=0.84s tid=0x28002c00 nid=0x5f14 runnable [0x00000000]
[2025-06-19T22:49:28.004Z] java.lang.Thread.State: TERMINATED
[2025-06-19T22:49:28.004Z]
[2025-06-19T22:49:28.004Z] "Thread-484" #494 prio=5 os_prio=0 cpu=0.00ms elapsed=0.84s tid=0x28007400 nid=0x5b30 runnable [0x00000000]
[2025-06-19T22:49:28.004Z] java.lang.Thread.State: TERMINATED
[2025-06-19T22:49:28.004Z]
[2025-06-19T22:49:28.004Z] "Thread-485" #495 prio=5 os_prio=0 cpu=0.00ms elapsed=0.84s tid=0x28006000 nid=0xf2f0 runnable [0x00000000]
[2025-06-19T22:49:28.004Z] java.lang.Thread.State: TERMINATED
[2025-06-19T22:49:28.004Z]
[2025-06-19T22:49:28.004Z] "Thread-486" #496 prio=5 os_prio=0 cpu=0.00ms elapsed=0.84s tid=0x28007000 nid=0x9eb8 runnable [0x00000000]
[2025-06-19T22:49:28.004Z] java.lang.Thread.State: TERMINATED
[2025-06-19T22:49:28.004Z]
[2025-06-19T22:49:28.004Z] "Thread-488" #498 prio=5 os_prio=0 cpu=0.00ms elapsed=0.84s tid=0x28003400 nid=0xb2c4 runnable [0x00000000]
[2025-06-19T22:49:28.004Z] java.lang.Thread.State: TERMINATED
[2025-06-19T22:49:28.004Z]
[2025-06-19T22:49:28.004Z] "Thread-490" #500 prio=5 os_prio=0 cpu=0.00ms elapsed=0.84s tid=0x28002400 nid=0x9ff0 runnable [0x00000000]
[2025-06-19T22:49:28.004Z] java.lang.Thread.State: TERMINATED
[2025-06-19T22:49:28.004Z]
[2025-06-19T22:49:28.004Z] "Thread-494" #504 prio=5 os_prio=0 cpu=0.00ms elapsed=0.84s t
[2025-06-19T22:49:28.004Z]
[2025-06-19T22:49:28.004Z] ...
[2025-06-19T22:49:28.004Z] Output overflow:
[2025-06-19T22:49:28.004Z] JT Harness has limited the test output to the text
[2025-06-19T22:49:28.004Z] at the beginning and the end, so that you can see how the
[2025-06-19T22:49:28.004Z] test began, and how it completed.
[2025-06-19T22:49:28.004Z]
[2025-06-19T22:49:28.004Z] If you need to see more of the output from the test,
[2025-06-19T22:49:28.004Z] set the system property javatest.maxOutputSize to a higher
[2025-06-19T22:49:28.004Z] value. The current value is 100000
[2025-06-19T22:49:28.004Z] ...
[2025-06-19T22:49:28.004Z]
[2025-06-19T22:49:28.004Z] read.State: TERMINATED
[2025-06-19T22:49:28.004Z]
[2025-06-19T22:49:28.004Z] "Thread-1828" #1838 prio=5 os_prio=0 cpu=0.00ms elapsed=0.81s tid=0x41de7c00 nid=0x9c90 runnable [0x00000000]
[2025-06-19T22:49:28.004Z] java.lang.Thread.State: TERMINATED
[2025-06-19T22:49:28.004Z]
[2025-06-19T22:49:28.004Z] "Thread-1832" #1842 prio=5 os_prio=0 cpu=0.00ms elapsed=0.81s tid=0x41de1400 nid=0x8650 runnable [0x00000000]
[2025-06-19T22:49:28.004Z] java.lang.Thread.State: TERMINATED
[2025-06-19T22:49:28.004Z]
[2025-06-19T22:49:28.004Z] "Thread-1834" #1844 prio=5 os_prio=0 cpu=0.00ms elapsed=0.81s tid=0x41de8800 nid=0x88dc runnable [0x00000000]
[2025-06-19T22:49:28.004Z] java.lang.Thread.State: TERMINATED
[2025-06-19T22:49:28.004Z]
[2025-06-19T22:49:28.004Z] "Thread-1835" #1845 prio=5 os_prio=0 cpu=0.00ms elapsed=0.81s tid=0x41de9000 nid=0x3c24 runnable [0x00000000]
[2025-06-19T22:49:28.004Z] java.lang.Thread.State: TERMINATED
[2025-06-19T22:49:28.004Z]
[2025-06-19T22:49:28.004Z] "Thread-1839" #1849 prio=5 os_prio=0 cpu=0.00ms elapsed=0.81s tid=0x41de3400 nid=0x1744 runnable [0x00000000]
[2025-06-19T22:49:28.004Z] java.lang.Thread.State: TERMINATED
[2025-06-19T22:49:28.004Z]
[2025-06-19T22:49:28.004Z] "Thread-1841" #1851 prio=5 os_prio=0 cpu=0.00ms elapsed=0.81s tid=0x41dea800 nid=0xc570 runnable [0x00000000]
[2025-06-19T22:49:28.004Z] java.lang.Thread.State: TERMINATED
[2025-06-19T22:49:28.004Z]
[2025-06-19T22:49:28.004Z] "Thread-1845" #1855 prio=5 os_prio=0 cpu=0.00ms elapsed=0.81s tid=0x41deb400 nid=0xce80 runnable [0x00000000]
[2025-06-19T22:49:28.004Z] java.lang.Thread.State: TERMINATED
[2025-06-19T22:49:28.004Z]
[2025-06-19T22:49:28.004Z] "Thread-1847" #1857 prio=5 os_prio=0 cpu=0.00ms elapsed=0.81s tid=0x41deac00 nid=0xd4f8 runnable [0x00000000]
[2025-06-19T22:49:28.004Z] java.lang.Thread.State: TERMINATED
[2025-06-19T22:49:28.004Z]
[2025-06-19T22:49:28.004Z] "Thread-1848" #1858 prio=5 os_prio=0 cpu=0.00ms elapsed=0.81s tid=0x41ded800 nid=0xbb88 runnable [0x00000000]
[2025-06-19T22:49:28.004Z] java.lang.Thread.State: TERMINATED
[2025-06-19T22:49:28.004Z]
[2025-06-19T22:49:28.004Z] "Thread-1849" #1859 prio=5 os_prio=0 cpu=0.00ms elapsed=0.81s tid=0x41def000 nid=0xd970 runnable [0x00000000]
[2025-06-19T22:49:28.004Z] java.lang.Thread.State: TERMINATED
[2025-06-19T22:49:28.004Z]
[2025-06-19T22:49:28.004Z] "Thread-1852" #1862 prio=5 os_prio=0 cpu=0.00ms elapsed=0.81s tid=0x41df1400 nid=0xd4f0 runnable [0x00000000]
[2025-06-19T22:49:28.004Z] java.lang.Thread.State: TERMINATED
[2025-06-19T22:49:28.004Z]
[2025-06-19T22:49:28.004Z] "Thread-1853" #1863 prio=5 os_prio=0 cpu=0.00ms elapsed=0.81s tid=0x41df2400 nid=0x10c68 runnable [0x00000000]
[2025-06-19T22:49:28.004Z] java.lang.Thread.State: TERMINATED
[2025-06-19T22:49:28.004Z]
[2025-06-19T22:49:28.004Z] "Thread-1856" #1866 prio=5 os_prio=0 cpu=0.00ms elapsed=0.81s tid=0x41df6400 nid=0x2a48 runnable [0x00000000]
[2025-06-19T22:49:28.004Z] java.lang.Thread.State: TERMINATED
[2025-06-19T22:49:28.004Z]
[2025-06-19T22:49:28.004Z] "Thread-1857" #1867 prio=5 os_prio=0 cpu=0.00ms elapsed=0.81s tid=0x41df5000 nid=0x9360 runnable [0x00000000]
[2025-06-19T22:49:28.004Z] java.lang.Thread.State: TERMINATED
[2025-06-19T22:49:28.004Z]
[2025-06-19T22:49:28.004Z] "Thread-1860" #1870 prio=5 os_prio=0 cpu=0.00ms elapsed=0.81s tid=0x41def800 nid=0x91d8 runnable [0x00000000]
[2025-06-19T22:49:28.004Z] java.lang.Thread.State: TERMINATED
[2025-06-19T22:49:28.004Z]
[2025-06-19T22:49:28.004Z] "Thread-1861" #1871 prio=5 os_prio=0 cpu=0.00ms elapsed=0.81s tid=0x41df3000 nid=0x63ec runnable [0x00000000]
[2025-06-19T22:49:28.004Z] java.lang.Thread.State: TERMINATED
[2025-06-19T22:49:28.004Z]
[2025-06-19T22:49:28.004Z] "Thread-1864" #1874 prio=5 os_prio=0 cpu=0.00ms elapsed=0.81s tid=0x41df3800 nid=0x8e30 runnable [0x00000000]
[2025-06-19T22:49:28.005Z] java.lang.Thread.State: TERMINATED
[2025-06-19T22:49:28.005Z]
[2025-06-19T22:49:28.005Z] "Thread-1867" #1877 prio=5 os_prio=0 cpu=0.00ms elapsed=0.81s tid=0x41df7800 nid=0x5af4 runnable [0x00000000]
[2025-06-19T22:49:28.005Z] java.lang.Thread.State: TERMINATED
[2025-06-19T22:49:28.005Z]
[2025-06-19T22:49:28.005Z] "Thread-1871" #1881 prio=5 os_prio=0 cpu=0.00ms elapsed=0.81s tid=0x41df1c00 nid=0x44dc runnable [0x00000000]
[2025-06-19T22:49:28.005Z] java.lang.Thread.State: TERMINATED
[2025-06-19T22:49:28.005Z]
[2025-06-19T22:49:28.005Z] "Thread-1873" #1883 prio=5 os_prio=0 cpu=0.00ms elapsed=0.81s tid=0x41dfd000 nid=0xd5b4 runnable [0x00000000]
[2025-06-19T22:49:28.005Z] java.lang.Thread.State: TERMINATED
[2025-06-19T22:49:28.005Z]
[2025-06-19T22:49:28.005Z] "Thread-1875" #1885 prio=5 os_prio=0 cpu=0.00ms elapsed=0.81s tid=0x41df9800 nid=0x5ec4 runnable [0x00000000]
[2025-06-19T22:49:28.005Z] java.lang.Thread.State: TERMINATED
[2025-06-19T22:49:28.005Z]
[2025-06-19T22:49:28.005Z] "Thread-1878" #1888 prio=5 os_prio=0 cpu=0.00ms elapsed=0.80s tid=0x41dfbc00 nid=0x5974 runnable [0x00000000]
[2025-06-19T22:49:28.005Z] java.lang.Thread.State: TERMINATED
[2025-06-19T22:49:28.005Z]
[2025-06-19T22:49:28.005Z] "Thread-1880" #1890 prio=5 os_prio=0 cpu=0.00ms elapsed=0.80s tid=0x41dfc800 nid=0x62b8 runnable [0x00000000]
[2025-06-19T22:49:28.005Z] java.lang.Thread.State: TERMINATED
[2025-06-19T22:49:28.005Z]
[2025-06-19T22:49:28.005Z] "Thread-1881" #1891 prio=5 os_prio=0 cpu=0.00ms elapsed=0.80s tid=0x41dfa000 nid=0xbe98 runnable [0x00000000]
[2025-06-19T22:49:28.005Z] java.lang.Thread.State: TERMINATED
[2025-06-19T22:49:28.005Z]
[2025-06-19T22:49:28.005Z] "Thread-1882" #1892 prio=5 os_prio=0 cpu=0.00ms elapsed=0.80s tid=0x41dfd800 nid=0xbee8 runnable [0x00000000]
[2025-06-19T22:49:28.005Z] java.lang.Thread.State: TERMINATED
[2025-06-19T22:49:28.005Z]
[2025-06-19T22:49:28.005Z] "Thread-1885" #1895 prio=5 os_prio=0 cpu=0.00ms elapsed=0.80s tid=0x41ebe400 nid=0xf5ec runnable [0x00000000]
[2025-06-19T22:49:28.005Z] java.lang.Thread.State: TERMINATED
[2025-06-19T22:49:28.005Z]
[2025-06-19T22:49:28.005Z] "Thread-1892" #1902 prio=5 os_prio=0 cpu=0.00ms elapsed=0.80s tid=0x41eb9400 nid=0xac24 runnable [0x00000000]
[2025-06-19T22:49:28.005Z] java.lang.Thread.State: TERMINATED
[2025-06-19T22:49:28.005Z]
[2025-06-19T22:49:28.005Z] "Thread-1894" #1904 prio=5 os_prio=0 cpu=0.00ms elapsed=0.80s tid=0x41ebc000 nid=0x410c runnable [0x00000000]
[2025-06-19T22:49:28.005Z] java.lang.Thread.State: TERMINATED
[2025-06-19T22:49:28.005Z]
[2025-06-19T22:49:28.005Z] "Thread-1898" #1908 prio=5 os_prio=0 cpu=0.00ms elapsed=0.80s tid=0x41ec0c00 nid=0x8b20 runnable [0x00000000]
[2025-06-19T22:49:28.005Z] java.lang.Thread.State: TERMINATED
[2025-06-19T22:49:28.005Z]
[2025-06-19T22:49:28.005Z] "Thread-1900" #1910 prio=5 os_prio=0 cpu=0.00ms elapsed=0.80s tid=0x41ebec00 nid=0x4ba0 runnable [0x00000000]
[2025-06-19T22:49:28.005Z] java.lang.Thread.State: TERMINATED
[2025-06-19T22:49:28.005Z]
[2025-06-19T22:49:28.005Z] "Thread-1903" #1913 prio=5 os_prio=0 cpu=0.00ms elapsed=0.80s tid=0x41ebd000 nid=0x1e48 runnable [0x00000000]
[2025-06-19T22:49:28.005Z] java.lang.Thread.State: TERMINATED
[2025-06-19T22:49:28.005Z]
[2025-06-19T22:49:28.005Z] "Thread-1904" #1914 prio=5 os_prio=0 cpu=0.00ms elapsed=0.80s tid=0x41ebac00 nid=0x4dc4 runnable [0x00000000]
[2025-06-19T22:49:28.005Z] java.lang.Thread.State: TERMINATED
[2025-06-19T22:49:28.005Z]
[2025-06-19T22:49:28.005Z] "Thread-1907" #1917 prio=5 os_prio=0 cpu=15.62ms elapsed=0.80s tid=0x41ec6000 nid=0x3d20 runnable [0x00000000]
[2025-06-19T22:49:28.005Z] java.lang.Thread.State: TERMINATED
[2025-06-19T22:49:28.005Z]
[2025-06-19T22:49:28.005Z] "Thread-1910" #1920 prio=5 os_prio=0 cpu=0.00ms elapsed=0.80s tid=0x41ec3c00 nid=0xd290 runnable [0x00000000]
[2025-06-19T22:49:28.005Z] java.lang.Thread.State: TERMINATED
[2025-06-19T22:49:28.005Z]
[2025-06-19T22:49:28.005Z] "Thread-1911" #1921 prio=5 os_prio=0 cpu=0.00ms elapsed=0.80s tid=0x41ec3400 nid=0xa2d0 runnable [0x00000000]
[2025-06-19T22:49:28.005Z] java.lang.Thread.State: TERMINATED
[2025-06-19T22:49:28.005Z]
[2025-06-19T22:49:28.005Z] "Thread-1913" #1923 prio=5 os_prio=0 cpu=0.00ms elapsed=0.80s tid=0x41ec4400 nid=0x6f74 runnable [0x00000000]
[2025-06-19T22:49:28.005Z] java.lang.Thread.State: TERMINATED
[2025-06-19T22:49:28.005Z]
[2025-06-19T22:49:28.005Z] "Thread-1914" #1924 prio=5 os_prio=0 cpu=0.00ms elapsed=0.80s tid=0x41ec4c00 nid=0xa2f4 runnable [0x00000000]
[2025-06-19T22:49:28.005Z] java.lang.Thread.State: TERMINATED
[2025-06-19T22:49:28.005Z]
[2025-06-19T22:49:28.005Z] "Thread-1918" #1928 prio=5 os_prio=0 cpu=0.00ms elapsed=0.80s tid=0x41ec9c00 nid=0xcb84 runnable [0x00000000]
[2025-06-19T22:49:28.005Z] java.lang.Thread.State: TERMINATED
[2025-06-19T22:49:28.005Z]
[2025-06-19T22:49:28.005Z] "Thread-1919" #1929 prio=5 os_prio=0 cpu=0.00ms elapsed=0.80s tid=0x41ec8000 nid=0xb62c runnable [0x00000000]
[2025-06-19T22:49:28.005Z] java.lang.Thread.State: TERMINATED
[2025-06-19T22:49:28.005Z]
[2025-06-19T22:49:28.005Z] "Thread-1920" #1930 prio=5 os_prio=0 cpu=0.00ms elapsed=0.80s tid=0x41ecd800 nid=0x5444 runnable [0x00000000]
[2025-06-19T22:49:28.005Z] java.lang.Thread.State: TERMINATED
[2025-06-19T22:49:28.005Z]
[2025-06-19T22:49:28.005Z] "Thread-1926" #1936 prio=5 os_prio=0 cpu=0.00ms elapsed=0.80s tid=0x41ec8c00 nid=0x5ec0 runnable [0x00000000]
[2025-06-19T22:49:28.005Z] java.lang.Thread.State: TERMINATED
[2025-06-19T22:49:28.005Z]
[2025-06-19T22:49:28.005Z] "Thread-1927" #1937 prio=5 os_prio=0 cpu=0.00ms elapsed=0.80s tid=0x41ec6800 nid=0x3fd4 runnable [0x00000000]
[2025-06-19T22:49:28.005Z] java.lang.Thread.State: TERMINATED
[2025-06-19T22:49:28.005Z]
[2025-06-19T22:49:28.005Z] "Thread-1929" #1939 prio=5 os_prio=0 cpu=0.00ms elapsed=0.80s tid=0x41ecdc00 nid=0xdac4 runnable [0x00000000]
[2025-06-19T22:49:28.005Z] java.lang.Thread.State: TERMINATED
[2025-06-19T22:49:28.005Z]
[2025-06-19T22:49:28.005Z] "Thread-1933" #1943 prio=5 os_prio=0 cpu=0.00ms elapsed=0.80s tid=0x41ecf400 nid=0xcb40 runnable [0x00000000]
[2025-06-19T22:49:28.005Z] java.lang.Thread.State: TERMINATED
[2025-06-19T22:49:28.005Z]
[2025-06-19T22:49:28.005Z] "Thread-1934" #1944 prio=5 os_prio=0 cpu=0.00ms elapsed=0.80s tid=0x41ec8800 nid=0x2834 runnable [0x00000000]
[2025-06-19T22:49:28.005Z] java.lang.Thread.State: TERMINATED
[2025-06-19T22:49:28.005Z]
[2025-06-19T22:49:28.005Z] "Thread-1935" #1945 prio=5 os_prio=0 cpu=0.00ms elapsed=0.80s tid=0x41ed4400 nid=0x106f4 runnable [0x00000000]
[2025-06-19T22:49:28.005Z] java.lang.Thread.State: TERMINATED
[2025-06-19T22:49:28.005Z]
[2025-06-19T22:49:28.005Z] "Thread-1937" #1947 prio=5 os_prio=0 cpu=0.00ms elapsed=0.80s tid=0x41ed4c00 nid=0xe4a0 runnable [0x00000000]
[2025-06-19T22:49:28.005Z] java.lang.Thread.State: TERMINATED
[2025-06-19T22:49:28.005Z]
[2025-06-19T22:49:28.005Z] "Thread-1938" #1948 prio=5 os_prio=0 cpu=0.00ms elapsed=0.80s tid=0x41ed0000 nid=0xa630 runnable [0x00000000]
[2025-06-19T22:49:28.005Z] java.lang.Thread.State: TERMINATED
[2025-06-19T22:49:28.005Z]
[2025-06-19T22:49:28.005Z] "Thread-1940" #1950 prio=5 os_prio=0 cpu=0.00ms elapsed=0.80s tid=0x41ed1000 nid=0xf934 runnable [0x00000000]
[2025-06-19T22:49:28.005Z] java.lang.Thread.State: TERMINATED
[2025-06-19T22:49:28.005Z]
[2025-06-19T22:49:28.005Z] "Thread-1943" #1953 prio=5 os_prio=0 cpu=0.00ms elapsed=0.80s tid=0x41ed2000 nid=0xeab4 runnable [0x00000000]
[2025-06-19T22:49:28.005Z] java.lang.Thread.State: TERMINATED
[2025-06-19T22:49:28.005Z]
[2025-06-19T22:49:28.005Z] "Thread-1944" #1954 prio=5 os_prio=0 cpu=0.00ms elapsed=0.80s tid=0x41ed2800 nid=0xf148 runnable [0x00000000]
[2025-06-19T22:49:28.005Z] java.lang.Thread.State: TERMINATED
[2025-06-19T22:49:28.005Z]
[2025-06-19T22:49:28.005Z] "Thread-1949" #1959 prio=5 os_prio=0 cpu=0.00ms elapsed=0.80s tid=0x41ed8c00 nid=0x7f60 runnable [0x00000000]
[2025-06-19T22:49:28.005Z] java.lang.Thread.State: TERMINATED
[2025-06-19T22:49:28.005Z]
[2025-06-19T22:49:28.005Z] "Thread-1950" #1960 prio=5 os_prio=0 cpu=0.00ms elapsed=0.80s tid=0x41edc000 nid=0x1ae8 runnable [0x00000000]
[2025-06-19T22:49:28.005Z] java.lang.Thread.State: TERMINATED
[2025-06-19T22:49:28.005Z]
[2025-06-19T22:49:28.005Z] "Thread-1954" #1964 prio=5 os_prio=0 cpu=0.00ms elapsed=0.80s tid=0x41ed6000 nid=0x503c runnable [0x00000000]
[2025-06-19T22:49:28.005Z] java.lang.Thread.State: TERMINATED
[2025-06-19T22:49:28.005Z]
[2025-06-19T22:49:28.005Z] "Thread-1962" #1972 prio=5 os_prio=0 cpu=0.00ms elapsed=0.80s tid=0x41ed8400 nid=0xf844 runnable [0x00000000]
[2025-06-19T22:49:28.005Z] java.lang.Thread.State: TERMINATED
[2025-06-19T22:49:28.005Z]
[2025-06-19T22:49:28.005Z] "main" #1 prio=5 os_prio=0 cpu=140.62ms elapsed=1.26s tid=0x023a4c00 nid=0xe8e4 in Object.wait() [0x022ff000]
[2025-06-19T22:49:28.005Z] java.lang.Thread.State: WAITING (on object monitor)
[2025-06-19T22:49:28.005Z] at java.lang.Object.wait(java.base@11.0.28-beta/Native Method)
[2025-06-19T22:49:28.005Z] - waiting on <0x04b47470> (a java.lang.Thread)
[2025-06-19T22:49:28.005Z] at java.lang.Thread.join(java.base@11.0.28-beta/Thread.java:1300)
[2025-06-19T22:49:28.005Z] - waiting to re-lock in wait() <0x04b47470> (a java.lang.Thread)
[2025-06-19T22:49:28.005Z] at java.lang.Thread.join(java.base@11.0.28-beta/Thread.java:1375)
[2025-06-19T22:49:28.005Z] at com.sun.javatest.regtest.agent.MainWrapper.main(MainWrapper.java:85)
[2025-06-19T22:49:28.005Z]
[2025-06-19T22:49:28.005Z] "Reference Handler" #2 daemon prio=10 os_prio=2 cpu=0.00ms elapsed=1.23s tid=0x0245b000 nid=0x7308 waiting on condition [0x24f7f000]
[2025-06-19T22:49:28.005Z] java.lang.Thread.State: RUNNABLE
[2025-06-19T22:49:28.005Z] at java.lang.ref.Reference.waitForReferencePendingList(java.base@11.0.28-beta/Native Method)
[2025-06-19T22:49:28.005Z] at java.lang.ref.Reference.processPendingReferences(java.base@11.0.28-beta/Reference.java:241)
[2025-06-19T22:49:28.005Z] at java.lang.ref.Reference$ReferenceHandler.run(java.base@11.0.28-beta/Reference.java:213)
[2025-06-19T22:49:28.005Z]
[2025-06-19T22:49:28.005Z] "Finalizer" #3 daemon prio=8 os_prio=1 cpu=0.00ms elapsed=1.23s tid=0x0245c800 nid=0x9ab0 in Object.wait() [0x2500f000]
[2025-06-19T22:49:28.005Z] java.lang.Thread.State: WAITING (on object monitor)
[2025-06-19T22:49:28.005Z] at java.lang.Object.wait(java.base@11.0.28-beta/Native Method)
[2025-06-19T22:49:28.005Z] - waiting on <0x04a07e98> (a java.lang.ref.ReferenceQueue$Lock)
[2025-06-19T22:49:28.006Z] at java.lang.ref.ReferenceQueue.remove(java.base@11.0.28-beta/ReferenceQueue.java:155)
[2025-06-19T22:49:28.006Z] - waiting to re-lock in wait() <0x04a07e98> (a java.lang.ref.ReferenceQueue$Lock)
[2025-06-19T22:49:28.006Z] at java.lang.ref.ReferenceQueue.remove(java.base@11.0.28-beta/ReferenceQueue.java:176)
[2025-06-19T22:49:28.006Z] at java.lang.ref.Finalizer$FinalizerThread.run(java.base@11.0.28-beta/Finalizer.java:170)
[2025-06-19T22:49:28.006Z]
[2025-06-19T22:49:28.006Z] "Signal Dispatcher" #4 daemon prio=9 os_prio=2 cpu=0.00ms elapsed=1.20s tid=0x0247f400 nid=0x3a54 runnable [0x00000000]
[2025-06-19T22:49:28.006Z] java.lang.Thread.State: RUNNABLE
[2025-06-19T22:49:28.006Z]
[2025-06-19T22:49:28.006Z] "Attach Listener" #5 daemon prio=5 os_prio=2 cpu=0.00ms elapsed=1.20s tid=0x02480000 nid=0x60a8 runnable [0x00000000]
[2025-06-19T22:49:28.006Z] java.lang.Thread.State: RUNNABLE
[2025-06-19T22:49:28.006Z]
[2025-06-19T22:49:28.006Z] "Service Thread" #6 daemon prio=9 os_prio=0 cpu=0.00ms elapsed=1.20s tid=0x02480c00 nid=0x28e8 runnable [0x00000000]
[2025-06-19T22:49:28.006Z] java.lang.Thread.State: RUNNABLE
[2025-06-19T22:49:28.006Z]
[2025-06-19T22:49:28.006Z] "C1 CompilerThread0" #7 daemon prio=9 os_prio=2 cpu=31.25ms elapsed=1.20s tid=0x02481c00 nid=0xf740 waiting on condition [0x00000000]
[2025-06-19T22:49:28.006Z] java.lang.Thread.State: RUNNABLE
[2025-06-19T22:49:28.006Z] No compile task
[2025-06-19T22:49:28.006Z]
[2025-06-19T22:49:28.006Z] "Sweeper thread" #8 daemon prio=9 os_prio=2 cpu=0.00ms elapsed=1.20s tid=0x25149400 nid=0x1e40 runnable [0x00000000]
[2025-06-19T22:49:28.006Z] java.lang.Thread.State: RUNNABLE
[2025-06-19T22:49:28.006Z]
[2025-06-19T22:49:28.006Z] "Common-Cleaner" #9 daemon prio=8 os_prio=1 cpu=0.00ms elapsed=1.15s tid=0x251d1c00 nid=0x10cf8 in Object.wait() [0x2570f000]
[2025-06-19T22:49:28.006Z] java.lang.Thread.State: TIMED_WAITING (on object monitor)
[2025-06-19T22:49:28.006Z] at java.lang.Object.wait(java.base@11.0.28-beta/Native Method)
[2025-06-19T22:49:28.006Z] - waiting on <0x04acf178> (a java.lang.ref.ReferenceQueue$Lock)
[2025-06-19T22:49:28.006Z] at java.lang.ref.ReferenceQueue.remove(java.base@11.0.28-beta/ReferenceQueue.java:155)
[2025-06-19T22:49:28.006Z] - waiting to re-lock in wait() <0x04acf178> (a java.lang.ref.ReferenceQueue$Lock)
[2025-06-19T22:49:28.006Z] at jdk.internal.ref.CleanerImpl.run(java.base@11.0.28-beta/CleanerImpl.java:148)
[2025-06-19T22:49:28.006Z] at java.lang.Thread.run(java.base@11.0.28-beta/Thread.java:829)
[2025-06-19T22:49:28.006Z] at jdk.internal.misc.InnocuousThread.run(java.base@11.0.28-beta/InnocuousThread.java:161)
[2025-06-19T22:49:28.006Z]
[2025-06-19T22:49:28.006Z] "MainThread" #10 prio=5 os_prio=0 cpu=250.00ms elapsed=1.08s tid=0x25290400 nid=0xd9d4 waiting on condition [0x2579e000]
[2025-06-19T22:49:28.006Z] java.lang.Thread.State: RUNNABLE
[2025-06-19T22:49:28.006Z] at java.util.zip.ZipFile$Source.readFullyAt(java.base@11.0.28-beta/ZipFile.java:1497)
[2025-06-19T22:49:28.006Z] - locked <0x04ae8730> (a java.io.RandomAccessFile)
[2025-06-19T22:49:28.006Z] at java.util.zip.ZipFile$ZipFileInputStream.initDataOffset(java.base@11.0.28-beta/ZipFile.java:1014)
[2025-06-19T22:49:28.006Z] at java.util.zip.ZipFile$ZipFileInputStream.read(java.base@11.0.28-beta/ZipFile.java:1029)
[2025-06-19T22:49:28.006Z] - locked <0x04ae7ff8> (a java.util.jar.JarFile)
[2025-06-19T22:49:28.006Z] at java.util.zip.ZipFile$ZipFileInflaterInputStream.fill(java.base@11.0.28-beta/ZipFile.java:479)
[2025-06-19T22:49:28.006Z] at java.util.zip.InflaterInputStream.read(java.base@11.0.28-beta/InflaterInputStream.java:159)
[2025-06-19T22:49:28.006Z] at jdk.internal.loader.Resource.getBytes(java.base@11.0.28-beta/Resource.java:124)
[2025-06-19T22:49:28.006Z] at jdk.internal.loader.URLClassPath$JarLoader$2.getBytes(java.base@11.0.28-beta/URLClassPath.java:884)
[2025-06-19T22:49:28.006Z] at jdk.internal.loader.BuiltinClassLoader.defineClass(java.base@11.0.28-beta/BuiltinClassLoader.java:797)
[2025-06-19T22:49:28.006Z] at jdk.internal.loader.BuiltinClassLoader.findClassOnClassPathOrNull(java.base@11.0.28-beta/BuiltinClassLoader.java:698)
[2025-06-19T22:49:28.006Z] at jdk.internal.loader.BuiltinClassLoader.loadClassOrNull(java.base@11.0.28-beta/BuiltinClassLoader.java:621)
[2025-06-19T22:49:28.006Z] - locked <0x04ccb388> (a java.lang.Object)
[2025-06-19T22:49:28.006Z] at jdk.internal.loader.BuiltinClassLoader.loadClass(java.base@11.0.28-beta/BuiltinClassLoader.java:579)
[2025-06-19T22:49:28.006Z] at jdk.internal.loader.ClassLoaders$AppClassLoader.loadClass(java.base@11.0.28-beta/ClassLoaders.java:178)
[2025-06-19T22:49:28.006Z] at java.lang.ClassLoader.loadClass(java.base@11.0.28-beta/ClassLoader.java:527)
[2025-06-19T22:49:28.006Z] at com.sun.javatest.regtest.agent.MainWrapper.handleTestException(MainWrapper.java:105)
[2025-06-19T22:49:28.006Z] at com.sun.javatest.regtest.agent.MainWrapper.access$000(MainWrapper.java:36)
[2025-06-19T22:49:28.006Z] at com.sun.javatest.regtest.agent.MainWrapper$MainTask.run(MainWrapper.java:147)
[2025-06-19T22:49:28.006Z] at java.lang.Thread.run(java.base@11.0.28-beta/Thread.java:829)
[2025-06-19T22:49:28.006Z]
[2025-06-19T22:49:28.006Z] "Thread-1" #11 prio=5 os_prio=0 cpu=15.62ms elapsed=1.06s tid=0x252b3800 nid=0x7630 runnable [0x2582f000]
[2025-06-19T22:49:28.006Z] java.lang.Thread.State: RUNNABLE
[2025-06-19T22:49:28.006Z] at sun.hotspot.WhiteBox.handshakeWalkStack(Native Method)
[2025-06-19T22:49:28.006Z] at HandshakeWalkExitTest$1.run(HandshakeWalkExitTest.java:56)
[2025-06-19T22:49:28.006Z] at java.lang.Thread.run(java.base@11.0.28-beta/Thread.java:829)
[2025-06-19T22:49:28.006Z]
[2025-06-19T22:49:28.006Z] "main" #1 prio=5 os_prio=0 cpu=140.62ms elapsed=1.26s tid=0x023a4c00 nid=0xe8e4 in Object.wait() [0x022ff000]
[2025-06-19T22:49:28.006Z] java.lang.Thread.State: WAITING (on object monitor)
[2025-06-19T22:49:28.006Z] at java.lang.Object.wait(java.base@11.0.28-beta/Native Method)
[2025-06-19T22:49:28.006Z] - waiting on <0x04b47470> (a java.lang.Thread)
[2025-06-19T22:49:28.006Z] at java.lang.Thread.join(java.base@11.0.28-beta/Thread.java:1300)
[2025-06-19T22:49:28.006Z] - waiting to re-lock in wait() <0x04b47470> (a java.lang.Thread)
[2025-06-19T22:49:28.006Z] at java.lang.Thread.join(java.base@11.0.28-beta/Thread.java:1375)
[2025-06-19T22:49:28.006Z] at com.sun.javatest.regtest.agent.MainWrapper.main(MainWrapper.java:85)
[2025-06-19T22:49:28.006Z]
[2025-06-19T22:49:28.006Z] "Reference Handler" #2 daemon prio=10 os_prio=2 cpu=0.00ms elapsed=1.23s tid=0x0245b000 nid=0x7308 waiting on condition [0x24f7f000]
[2025-06-19T22:49:28.006Z] java.lang.Thread.State: RUNNABLE
[2025-06-19T22:49:28.006Z] at java.lang.ref.Reference.waitForReferencePendingList(java.base@11.0.28-beta/Native Method)
[2025-06-19T22:49:28.006Z] at java.lang.ref.Reference.processPendingReferences(java.base@11.0.28-beta/Reference.java:241)
[2025-06-19T22:49:28.006Z] at java.lang.ref.Reference$ReferenceHandler.run(java.base@11.0.28-beta/Reference.java:213)
[2025-06-19T22:49:28.006Z]
[2025-06-19T22:49:28.006Z] "Finalizer" #3 daemon prio=8 os_prio=1 cpu=0.00ms elapsed=1.23s tid=0x0245c800 nid=0x9ab0 in Object.wait() [0x2500f000]
[2025-06-19T22:49:28.006Z] java.lang.Thread.State: WAITING (on object monitor)
[2025-06-19T22:49:28.006Z] at java.lang.Object.wait(java.base@11.0.28-beta/Native Method)
[2025-06-19T22:49:28.006Z] - waiting on <0x04a07e98> (a java.lang.ref.ReferenceQueue$Lock)
[2025-06-19T22:49:28.006Z] at java.lang.ref.ReferenceQueue.remove(java.base@11.0.28-beta/ReferenceQueue.java:155)
[2025-06-19T22:49:28.006Z] - waiting to re-lock in wait() <0x04a07e98> (a java.lang.ref.ReferenceQueue$Lock)
[2025-06-19T22:49:28.006Z] at java.lang.ref.ReferenceQueue.remove(java.base@11.0.28-beta/ReferenceQueue.java:176)
[2025-06-19T22:49:28.006Z] at java.lang.ref.Finalizer$FinalizerThread.run(java.base@11.0.28-beta/Finalizer.java:170)
[2025-06-19T22:49:28.006Z]
[2025-06-19T22:49:28.006Z] "Signal Dispatcher" #4 daemon prio=9 os_prio=2 cpu=0.00ms elapsed=1.20s tid=0x0247f400 nid=0x3a54 runnable [0x00000000]
[2025-06-19T22:49:28.006Z] java.lang.Thread.State: RUNNABLE
[2025-06-19T22:49:28.006Z]
[2025-06-19T22:49:28.006Z] "Attach Listener" #5 daemon prio=5 os_prio=2 cpu=0.00ms elapsed=1.20s tid=0x02480000 nid=0x60a8 runnable [0x00000000]
[2025-06-19T22:49:28.006Z] java.lang.Thread.State: RUNNABLE
[2025-06-19T22:49:28.006Z]
[2025-06-19T22:49:28.006Z] "Service Thread" #6 daemon prio=9 os_prio=0 cpu=0.00ms elapsed=1.20s tid=0x02480c00 nid=0x28e8 runnable [0x00000000]
[2025-06-19T22:49:28.006Z] java.lang.Thread.State: RUNNABLE
[2025-06-19T22:49:28.006Z]
[2025-06-19T22:49:28.006Z] "C1 CompilerThread0" #7 daemon prio=9 os_prio=2 cpu=31.25ms elapsed=1.20s tid=0x02481c00 nid=0xf740 waiting on condition [0x00000000]
[2025-06-19T22:49:28.006Z] java.lang.Thread.State: RUNNABLE
[2025-06-19T22:49:28.006Z] No compile task
[2025-06-19T22:49:28.006Z]
[2025-06-19T22:49:28.006Z] "Sweeper thread" #8 daemon prio=9 os_prio=2 cpu=0.00ms elapsed=1.20s tid=0x25149400 nid=0x1e40 runnable [0x00000000]
[2025-06-19T22:49:28.006Z] java.lang.Thread.State: RUNNABLE
[2025-06-19T22:49:28.006Z]
[2025-06-19T22:49:28.006Z] "Common-Cleaner" #9 daemon prio=8 os_prio=1 cpu=0.00ms elapsed=1.15s tid=0x251d1c00 nid=0x10cf8 in Object.wait() [0x2570f000]
[2025-06-19T22:49:28.006Z] java.lang.Thread.State: TIMED_WAITING (on object monitor)
[2025-06-19T22:49:28.006Z] at java.lang.Object.wait(java.base@11.0.28-beta/Native Method)
[2025-06-19T22:49:28.006Z] - waiting on <0x04acf178> (a java.lang.ref.ReferenceQueue$Lock)
[2025-06-19T22:49:28.006Z] at java.lang.ref.ReferenceQueue.remove(java.base@11.0.28-beta/ReferenceQueue.java:155)
[2025-06-19T22:49:28.006Z] - waiting to re-lock in wait() <0x04acf178> (a java.lang.ref.ReferenceQueue$Lock)
[2025-06-19T22:49:28.006Z] at jdk.internal.ref.CleanerImpl.run(java.base@11.0.28-beta/CleanerImpl.java:148)
[2025-06-19T22:49:28.006Z] at java.lang.Thread.run(java.base@11.0.28-beta/Thread.java:829)
[2025-06-19T22:49:28.006Z] at jdk.internal.misc.InnocuousThread.run(java.base@11.0.28-beta/InnocuousThread.java:161)
[2025-06-19T22:49:28.006Z]
[2025-06-19T22:49:28.006Z] "MainThread" #10 prio=5 os_prio=0 cpu=250.00ms elapsed=1.08s tid=0x25290400 nid=0xd9d4 runnable [0x2579e000]
[2025-06-19T22:49:28.006Z] java.lang.Thread.State: RUNNABLE
[2025-06-19T22:49:28.006Z] at java.util.zip.Inflater.inflateBytesBytes(java.base@11.0.28-beta/Native Method)
[2025-06-19T22:49:28.006Z] at java.util.zip.Inflater.inflate(java.base@11.0.28-beta/Inflater.java:385)
[2025-06-19T22:49:28.006Z] - locked <0x04b22198> (a java.util.zip.Inflater$InflaterZStreamRef)
[2025-06-19T22:49:28.006Z] at java.util.zip.InflaterInputStream.read(java.base@11.0.28-beta/InflaterInputStream.java:153)
[2025-06-19T22:49:28.007Z] at jdk.internal.loader.Resource.getBytes(java.base@11.0.28-beta/Resource.java:124)
[2025-06-19T22:49:28.007Z] at jdk.internal.loader.URLClassPath$JarLoader$2.getBytes(java.base@11.0.28-beta/URLClassPath.java:884)
[2025-06-19T22:49:28.007Z] at jdk.internal.loader.BuiltinClassLoader.defineClass(java.base@11.0.28-beta/BuiltinClassLoader.java:797)
[2025-06-19T22:49:28.007Z] at jdk.internal.loader.BuiltinClassLoader.findClassOnClassPathOrNull(java.base@11.0.28-beta/BuiltinClassLoader.java:698)
[2025-06-19T22:49:28.007Z] at jdk.internal.loader.BuiltinClassLoader.loadClassOrNull(java.base@11.0.28-beta/BuiltinClassLoader.java:621)
[2025-06-19T22:49:28.007Z] - locked <0x04ccb388> (a java.lang.Object)
[2025-06-19T22:49:28.007Z] at jdk.internal.loader.BuiltinClassLoader.loadClass(java.base@11.0.28-beta/BuiltinClassLoader.java:579)
[2025-06-19T22:49:28.007Z] at jdk.internal.loader.ClassLoaders$AppClassLoader.loadClass(java.base@11.0.28-beta/ClassLoaders.java:178)
[2025-06-19T22:49:28.007Z] at java.lang.ClassLoader.loadClass(java.base@11.0.28-beta/ClassLoader.java:527)
[2025-06-19T22:49:28.007Z] at com.sun.javatest.regtest.agent.MainWrapper.handleTestException(MainWrapper.java:105)
[2025-06-19T22:49:28.007Z] at com.sun.javatest.regtest.agent.MainWrapper.access$000(MainWrapper.java:36)
[2025-06-19T22:49:28.007Z] at com.sun.javatest.regtest.agent.MainWrapper$MainTask.run(MainWrapper.java:147)
[2025-06-19T22:49:28.007Z] at java.lang.Thread.run(java.base@11.0.28-beta/Thread.java:829)
[2025-06-19T22:49:28.007Z]
[2025-06-19T22:49:28.007Z] "Thread-1" #11 prio=5 os_prio=0 cpu=15.62ms elapsed=1.06s tid=0x252b3800 nid=0x7630 waiting on condition [0x2582f000]
[2025-06-19T22:49:28.007Z] java.lang.Thread.State: RUNNABLE
[2025-06-19T22:49:28.007Z] at sun.hotspot.WhiteBox.handshakeWalkStack(Native Method)
[2025-06-19T22:49:28.007Z] at HandshakeWalkExitTest$1.run(HandshakeWalkExitTest.java:56)
[2025-06-19T22:49:28.007Z] at java.lang.Thread.run(java.base@11.0.28-beta/Thread.java:829)
[2025-06-19T22:49:28.007Z]
[2025-06-19T22:49:28.007Z] "main" #1 prio=5 os_prio=0 cpu=140.62ms elapsed=1.26s tid=0x023a4c00 nid=0xe8e4 in Object.wait() [0x022ff000]
[2025-06-19T22:49:28.007Z] java.lang.Thread.State: WAITING (on object monitor)
[2025-06-19T22:49:28.007Z] at java.lang.Object.wait(java.base@11.0.28-beta/Native Method)
[2025-06-19T22:49:28.007Z] - waiting on <0x04b47470> (a java.lang.Thread)
[2025-06-19T22:49:28.007Z] at java.lang.Thread.join(java.base@11.0.28-beta/Thread.java:1300)
[2025-06-19T22:49:28.007Z] - waiting to re-lock in wait() <0x04b47470> (a java.lang.Thread)
[2025-06-19T22:49:28.007Z] at java.lang.Thread.join(java.base@11.0.28-beta/Thread.java:1375)
[2025-06-19T22:49:28.007Z] at com.sun.javatest.regtest.agent.MainWrapper.main(MainWrapper.java:85)
[2025-06-19T22:49:28.007Z]
[2025-06-19T22:49:28.007Z] "Reference Handler" #2 daemon prio=10 os_prio=2 cpu=0.00ms elapsed=1.23s tid=0x0245b000 nid=0x7308 waiting on condition [0x24f7f000]
[2025-06-19T22:49:28.007Z] java.lang.Thread.State: RUNNABLE
[2025-06-19T22:49:28.007Z] at java.lang.ref.Reference.waitForReferencePendingList(java.base@11.0.28-beta/Native Method)
[2025-06-19T22:49:28.007Z] at java.lang.ref.Reference.processPendingReferences(java.base@11.0.28-beta/Reference.java:241)
[2025-06-19T22:49:28.007Z] at java.lang.ref.Reference$ReferenceHandler.run(java.base@11.0.28-beta/Reference.java:213)
[2025-06-19T22:49:28.007Z]
[2025-06-19T22:49:28.007Z] "Finalizer" #3 daemon prio=8 os_prio=1 cpu=0.00ms elapsed=1.23s tid=0x0245c800 nid=0x9ab0 in Object.wait() [0x2500f000]
[2025-06-19T22:49:28.007Z] java.lang.Thread.State: WAITING (on object monitor)
[2025-06-19T22:49:28.007Z] at java.lang.Object.wait(java.base@11.0.28-beta/Native Method)
[2025-06-19T22:49:28.007Z] - waiting on <0x04a07e98> (a java.lang.ref.ReferenceQueue$Lock)
[2025-06-19T22:49:28.007Z] at java.lang.ref.ReferenceQueue.remove(java.base@11.0.28-beta/ReferenceQueue.java:155)
[2025-06-19T22:49:28.007Z] - waiting to re-lock in wait() <0x04a07e98> (a java.lang.ref.ReferenceQueue$Lock)
[2025-06-19T22:49:28.007Z] at java.lang.ref.ReferenceQueue.remove(java.base@11.0.28-beta/ReferenceQueue.java:176)
[2025-06-19T22:49:28.007Z] at java.lang.ref.Finalizer$FinalizerThread.run(java.base@11.0.28-beta/Finalizer.java:170)
[2025-06-19T22:49:28.007Z]
[2025-06-19T22:49:28.007Z] "Signal Dispatcher" #4 daemon prio=9 os_prio=2 cpu=0.00ms elapsed=1.20s tid=0x0247f400 nid=0x3a54 runnable [0x00000000]
[2025-06-19T22:49:28.007Z] java.lang.Thread.State: RUNNABLE
[2025-06-19T22:49:28.007Z]
[2025-06-19T22:49:28.007Z] "Attach Listener" #5 daemon prio=5 os_prio=2 cpu=0.00ms elapsed=1.20s tid=0x02480000 nid=0x60a8 runnable [0x00000000]
[2025-06-19T22:49:28.007Z] java.lang.Thread.State: RUNNABLE
[2025-06-19T22:49:28.007Z]
[2025-06-19T22:49:28.007Z] "Service Thread" #6 daemon prio=9 os_prio=0 cpu=0.00ms elapsed=1.20s tid=0x02480c00 nid=0x28e8 runnable [0x00000000]
[2025-06-19T22:49:28.007Z] java.lang.Thread.State: RUNNABLE
[2025-06-19T22:49:28.007Z]
[2025-06-19T22:49:28.007Z] "C1 CompilerThread0" #7 daemon prio=9 os_prio=2 cpu=31.25ms elapsed=1.20s tid=0x02481c00 nid=0xf740 waiting on condition [0x00000000]
[2025-06-19T22:49:28.007Z] java.lang.Thread.State: RUNNABLE
[2025-06-19T22:49:28.007Z] No compile task
[2025-06-19T22:49:28.007Z]
[2025-06-19T22:49:28.007Z] "Sweeper thread" #8 daemon prio=9 os_prio=2 cpu=0.00ms elapsed=1.20s tid=0x25149400 nid=0x1e40 runnable [0x00000000]
[2025-06-19T22:49:28.007Z] java.lang.Thread.State: RUNNABLE
[2025-06-19T22:49:28.007Z]
[2025-06-19T22:49:28.007Z] "Common-Cleaner" #9 daemon prio=8 os_prio=1 cpu=0.00ms elapsed=1.15s tid=0x251d1c00 nid=0x10cf8 in Object.wait() [0x2570f000]
[2025-06-19T22:49:28.007Z] java.lang.Thread.State: TIMED_WAITING (on object monitor)
[2025-06-19T22:49:28.007Z] at java.lang.Object.wait(java.base@11.0.28-beta/Native Method)
[2025-06-19T22:49:28.007Z] - waiting on <0x04acf178> (a java.lang.ref.ReferenceQueue$Lock)
[2025-06-19T22:49:28.007Z] at java.lang.ref.ReferenceQueue.remove(java.base@11.0.28-beta/ReferenceQueue.java:155)
[2025-06-19T22:49:28.007Z] - waiting to re-lock in wait() <0x04acf178> (a java.lang.ref.ReferenceQueue$Lock)
[2025-06-19T22:49:28.007Z] at jdk.internal.ref.CleanerImpl.run(java.base@11.0.28-beta/CleanerImpl.java:148)
[2025-06-19T22:49:28.007Z] at java.lang.Thread.run(java.base@11.0.28-beta/Thread.java:829)
[2025-06-19T22:49:28.007Z] at jdk.internal.misc.InnocuousThread.run(java.base@11.0.28-beta/InnocuousThread.java:161)
[2025-06-19T22:49:28.007Z]
[2025-06-19T22:49:28.007Z] "MainThread" #10 prio=5 os_prio=0 cpu=250.00ms elapsed=1.08s tid=0x25290400 nid=0xd9d4 runnable [0x2579f000]
[2025-06-19T22:49:28.007Z] java.lang.Thread.State: RUNNABLE
[2025-06-19T22:49:28.007Z] at java.lang.ClassLoader.defineClass1(java.base@11.0.28-beta/Native Method)
[2025-06-19T22:49:28.007Z] at java.lang.ClassLoader.defineClass(java.base@11.0.28-beta/ClassLoader.java:1022)
[2025-06-19T22:49:28.007Z] at java.security.SecureClassLoader.defineClass(java.base@11.0.28-beta/SecureClassLoader.java:174)
[2025-06-19T22:49:28.007Z] at jdk.internal.loader.BuiltinClassLoader.defineClass(java.base@11.0.28-beta/BuiltinClassLoader.java:800)
[2025-06-19T22:49:28.007Z] at jdk.internal.loader.BuiltinClassLoader.findClassOnClassPathOrNull(java.base@11.0.28-beta/BuiltinClassLoader.java:698)
[2025-06-19T22:49:28.007Z] at jdk.internal.loader.BuiltinClassLoader.loadClassOrNull(java.base@11.0.28-beta/BuiltinClassLoader.java:621)
[2025-06-19T22:49:28.007Z] - locked <0x04ccb388> (a java.lang.Object)
[2025-06-19T22:49:28.007Z] at jdk.internal.loader.BuiltinClassLoader.loadClass(java.base@11.0.28-beta/BuiltinClassLoader.java:579)
[2025-06-19T22:49:28.007Z] at jdk.internal.loader.ClassLoaders$AppClassLoader.loadClass(java.base@11.0.28-beta/ClassLoaders.java:178)
[2025-06-19T22:49:28.007Z] at java.lang.ClassLoader.loadClass(java.base@11.0.28-beta/ClassLoader.java:527)
[2025-06-19T22:49:28.007Z] at com.sun.javatest.regtest.agent.MainWrapper.handleTestException(MainWrapper.java:105)
[2025-06-19T22:49:28.007Z] at com.sun.javatest.regtest.agent.MainWrapper.access$000(MainWrapper.java:36)
[2025-06-19T22:49:28.007Z] at com.sun.javatest.regtest.agent.MainWrapper$MainTask.run(MainWrapper.java:147)
[2025-06-19T22:49:28.007Z] at java.lang.Thread.run(java.base@11.0.28-beta/Thread.java:829)
[2025-06-19T22:49:28.007Z]
[2025-06-19T22:49:28.007Z] "Thread-1" #11 prio=5 os_prio=0 cpu=15.62ms elapsed=1.06s tid=0x252b3800 nid=0x7630 waiting on condition [0x2582f000]
[2025-06-19T22:49:28.007Z] java.lang.Thread.State: RUNNABLE
[2025-06-19T22:49:28.007Z] at sun.hotspot.WhiteBox.handshakeWalkStack(Native Method)
[2025-06-19T22:49:28.007Z] at HandshakeWalkExitTest$1.run(HandshakeWalkExitTest.java:56)
[2025-06-19T22:49:28.007Z] at java.lang.Thread.run(java.base@11.0.28-beta/Thread.java:829)
[2025-06-19T22:49:28.007Z]
[2025-06-19T22:49:28.007Z] "main" #1 prio=5 os_prio=0 cpu=140.62ms elapsed=1.26s tid=0x023a4c00 nid=0xe8e4 in Object.wait() [0x022ff000]
[2025-06-19T22:49:28.007Z] java.lang.Thread.State: WAITING (on object monitor)
[2025-06-19T22:49:28.007Z] at java.lang.Object.wait(java.base@11.0.28-beta/Native Method)
[2025-06-19T22:49:28.007Z] - waiting on <0x04b47470> (a java.lang.Thread)
[2025-06-19T22:49:28.007Z] at java.lang.Thread.join(java.base@11.0.28-beta/Thread.java:1300)
[2025-06-19T22:49:28.007Z] - waiting to re-lock in wait() <0x04b47470> (a java.lang.Thread)
[2025-06-19T22:49:28.007Z] at java.lang.Thread.join(java.base@11.0.28-beta/Thread.java:1375)
[2025-06-19T22:49:28.007Z] at com.sun.javatest.regtest.agent.MainWrapper.main(MainWrapper.java:85)
[2025-06-19T22:49:28.007Z]
[2025-06-19T22:49:28.007Z] "Reference Handler" #2 daemon prio=10 os_prio=2 cpu=0.00ms elapsed=1.23s tid=0x0245b000 nid=0x7308 waiting on condition [0x24f7f000]
[2025-06-19T22:49:28.007Z] java.lang.Thread.State: RUNNABLE
[2025-06-19T22:49:28.007Z] at java.lang.ref.Reference.waitForReferencePendingList(java.base@11.0.28-beta/Native Method)
[2025-06-19T22:49:28.007Z] at java.lang.ref.Reference.processPendingReferences(java.base@11.0.28-beta/Reference.java:241)
[2025-06-19T22:49:28.007Z] at java.lang.ref.Reference$ReferenceHandler.run(java.base@11.0.28-beta/Reference.java:213)
[2025-06-19T22:49:28.007Z]
[2025-06-19T22:49:28.007Z] "Finalizer" #3 daemon prio=8 os_prio=1 cpu=0.00ms elapsed=1.23s tid=0x0245c800 nid=0x9ab0 in Object.wait() [0x2500f000]
[2025-06-19T22:49:28.007Z] java.lang.Thread.State: WAITING (on object monitor)
[2025-06-19T22:49:28.007Z] at java.lang.Object.wait(java.base@11.0.28-beta/Native Method)
[2025-06-19T22:49:28.007Z] - waiting on <0x04a07e98> (a java.lang.ref.ReferenceQueue$Lock)
[2025-06-19T22:49:28.008Z] at java.lang.ref.ReferenceQueue.remove(java.base@11.0.28-beta/ReferenceQueue.java:155)
[2025-06-19T22:49:28.008Z] - waiting to re-lock in wait() <0x04a07e98> (a java.lang.ref.ReferenceQueue$Lock)
[2025-06-19T22:49:28.008Z] at java.lang.ref.ReferenceQueue.remove(java.base@11.0.28-beta/ReferenceQueue.java:176)
[2025-06-19T22:49:28.008Z] at java.lang.ref.Finalizer$FinalizerThread.run(java.base@11.0.28-beta/Finalizer.java:170)
[2025-06-19T22:49:28.008Z]
[2025-06-19T22:49:28.008Z] "Signal Dispatcher" #4 daemon prio=9 os_prio=2 cpu=0.00ms elapsed=1.20s tid=0x0247f400 nid=0x3a54 runnable [0x00000000]
[2025-06-19T22:49:28.008Z] java.lang.Thread.State: RUNNABLE
[2025-06-19T22:49:28.008Z]
[2025-06-19T22:49:28.008Z] "Attach Listener" #5 daemon prio=5 os_prio=2 cpu=0.00ms elapsed=1.20s tid=0x02480000 nid=0x60a8 runnable [0x00000000]
[2025-06-19T22:49:28.008Z] java.lang.Thread.State: RUNNABLE
[2025-06-19T22:49:28.008Z]
[2025-06-19T22:49:28.008Z] "Service Thread" #6 daemon prio=9 os_prio=0 cpu=0.00ms elapsed=1.20s tid=0x02480c00 nid=0x28e8 runnable [0x00000000]
[2025-06-19T22:49:28.008Z] java.lang.Thread.State: RUNNABLE
[2025-06-19T22:49:28.008Z]
[2025-06-19T22:49:28.008Z] "C1 CompilerThread0" #7 daemon prio=9 os_prio=2 cpu=31.25ms elapsed=1.20s tid=0x02481c00 nid=0xf740 waiting on condition [0x00000000]
[2025-06-19T22:49:28.008Z] java.lang.Thread.State: RUNNABLE
[2025-06-19T22:49:28.008Z] No compile task
[2025-06-19T22:49:28.008Z]
[2025-06-19T22:49:28.008Z] "Sweeper thread" #8 daemon prio=9 os_prio=2 cpu=0.00ms elapsed=1.20s tid=0x25149400 nid=0x1e40 runnable [0x00000000]
[2025-06-19T22:49:28.008Z] java.lang.Thread.State: RUNNABLE
[2025-06-19T22:49:28.008Z]
[2025-06-19T22:49:28.008Z] "Common-Cleaner" #9 daemon prio=8 os_prio=1 cpu=0.00ms elapsed=1.15s tid=0x251d1c00 nid=0x10cf8 in Object.wait() [0x2570f000]
[2025-06-19T22:49:28.008Z] java.lang.Thread.State: TIMED_WAITING (on object monitor)
[2025-06-19T22:49:28.008Z] at java.lang.Object.wait(java.base@11.0.28-beta/Native Method)
[2025-06-19T22:49:28.008Z] - waiting on <0x04acf178> (a java.lang.ref.ReferenceQueue$Lock)
[2025-06-19T22:49:28.008Z] at java.lang.ref.ReferenceQueue.remove(java.base@11.0.28-beta/ReferenceQueue.java:155)
[2025-06-19T22:49:28.008Z] - waiting to re-lock in wait() <0x04acf178> (a java.lang.ref.ReferenceQueue$Lock)
[2025-06-19T22:49:28.008Z] at jdk.internal.ref.CleanerImpl.run(java.base@11.0.28-beta/CleanerImpl.java:148)
[2025-06-19T22:49:28.008Z] at java.lang.Thread.run(java.base@11.0.28-beta/Thread.java:829)
[2025-06-19T22:49:28.008Z] at jdk.internal.misc.InnocuousThread.run(java.base@11.0.28-beta/InnocuousThread.java:161)
[2025-06-19T22:49:28.008Z]
[2025-06-19T22:49:28.008Z] "MainThread" #10 prio=5 os_prio=0 cpu=250.00ms elapsed=1.08s tid=0x25290400 nid=0xd9d4 runnable [0x2579f000]
[2025-06-19T22:49:28.008Z] java.lang.Thread.State: RUNNABLE
[2025-06-19T22:49:28.008Z] at com.sun.javatest.regtest.agent.MainWrapper.handleTestException(MainWrapper.java:105)
[2025-06-19T22:49:28.008Z] at com.sun.javatest.regtest.agent.MainWrapper.access$000(MainWrapper.java:36)
[2025-06-19T22:49:28.008Z] at com.sun.javatest.regtest.agent.MainWrapper$MainTask.run(MainWrapper.java:147)
[2025-06-19T22:49:28.008Z] at java.lang.Thread.run(java.base@11.0.28-beta/Thread.java:829)
[2025-06-19T22:49:28.008Z]
[2025-06-19T22:49:28.008Z] "Thread-1" #11 prio=5 os_prio=0 cpu=15.62ms elapsed=1.06s tid=0x252b3800 nid=0x7630 waiting on condition [0x2582f000]
[2025-06-19T22:49:28.008Z] java.lang.Thread.State: RUNNABLE
[2025-06-19T22:49:28.008Z] at sun.hotspot.WhiteBox.handshakeWalkStack(Native Method)
[2025-06-19T22:49:28.008Z] at HandshakeWalkExitTest$1.run(HandshakeWalkExitTest.java:56)
[2025-06-19T22:49:28.008Z] at java.lang.Thread.run(java.base@11.0.28-beta/Thread.java:829)
[2025-06-19T22:49:28.008Z]
[2025-06-19T22:49:28.008Z] "main" #1 prio=5 os_prio=0 cpu=140.62ms elapsed=1.26s tid=0x023a4c00 nid=0xe8e4 in Object.wait() [0x022ff000]
[2025-06-19T22:49:28.008Z] java.lang.Thread.State: WAITING (on object monitor)
[2025-06-19T22:49:28.008Z] at java.lang.Object.wait(java.base@11.0.28-beta/Native Method)
[2025-06-19T22:49:28.008Z] - waiting on <0x04b47470> (a java.lang.Thread)
[2025-06-19T22:49:28.008Z] at java.lang.Thread.join(java.base@11.0.28-beta/Thread.java:1300)
[2025-06-19T22:49:28.008Z] - waiting to re-lock in wait() <0x04b47470> (a java.lang.Thread)
[2025-06-19T22:49:28.008Z] at java.lang.Thread.join(java.base@11.0.28-beta/Thread.java:1375)
[2025-06-19T22:49:28.008Z] at com.sun.javatest.regtest.agent.MainWrapper.main(MainWrapper.java:85)
[2025-06-19T22:49:28.008Z]
[2025-06-19T22:49:28.008Z] "Reference Handler" #2 daemon prio=10 os_prio=2 cpu=0.00ms elapsed=1.23s tid=0x0245b000 nid=0x7308 waiting on condition [0x24f7f000]
[2025-06-19T22:49:28.008Z] java.lang.Thread.State: RUNNABLE
[2025-06-19T22:49:28.008Z] at java.lang.ref.Reference.waitForReferencePendingList(java.base@11.0.28-beta/Native Method)
[2025-06-19T22:49:28.008Z] at java.lang.ref.Reference.processPendingReferences(java.base@11.0.28-beta/Reference.java:241)
[2025-06-19T22:49:28.008Z] at java.lang.ref.Reference$ReferenceHandler.run(java.base@11.0.28-beta/Reference.java:213)
[2025-06-19T22:49:28.008Z]
[2025-06-19T22:49:28.008Z] "Finalizer" #3 daemon prio=8 os_prio=1 cpu=0.00ms elapsed=1.23s tid=0x0245c800 nid=0x9ab0 in Object.wait() [0x2500f000]
[2025-06-19T22:49:28.008Z] java.lang.Thread.State: WAITING (on object monitor)
[2025-06-19T22:49:28.008Z] at java.lang.Object.wait(java.base@11.0.28-beta/Native Method)
[2025-06-19T22:49:28.008Z] - waiting on <0x04a07e98> (a java.lang.ref.ReferenceQueue$Lock)
[2025-06-19T22:49:28.008Z] at java.lang.ref.ReferenceQueue.remove(java.base@11.0.28-beta/ReferenceQueue.java:155)
[2025-06-19T22:49:28.008Z] - waiting to re-lock in wait() <0x04a07e98> (a java.lang.ref.ReferenceQueue$Lock)
[2025-06-19T22:49:28.008Z] at java.lang.ref.ReferenceQueue.remove(java.base@11.0.28-beta/ReferenceQueue.java:176)
[2025-06-19T22:49:28.008Z] at java.lang.ref.Finalizer$FinalizerThread.run(java.base@11.0.28-beta/Finalizer.java:170)
[2025-06-19T22:49:28.008Z]
[2025-06-19T22:49:28.008Z] "Signal Dispatcher" #4 daemon prio=9 os_prio=2 cpu=0.00ms elapsed=1.20s tid=0x0247f400 nid=0x3a54 runnable [0x00000000]
[2025-06-19T22:49:28.008Z] java.lang.Thread.State: RUNNABLE
[2025-06-19T22:49:28.008Z]
[2025-06-19T22:49:28.008Z] "Attach Listener" #5 daemon prio=5 os_prio=2 cpu=0.00ms elapsed=1.20s tid=0x02480000 nid=0x60a8 runnable [0x00000000]
[2025-06-19T22:49:28.008Z] java.lang.Thread.State: RUNNABLE
[2025-06-19T22:49:28.008Z]
[2025-06-19T22:49:28.008Z] "Service Thread" #6 daemon prio=9 os_prio=0 cpu=0.00ms elapsed=1.20s tid=0x02480c00 nid=0x28e8 runnable [0x00000000]
[2025-06-19T22:49:28.008Z] java.lang.Thread.State: RUNNABLE
[2025-06-19T22:49:28.008Z]
[2025-06-19T22:49:28.008Z] "C1 CompilerThread0" #7 daemon prio=9 os_prio=2 cpu=31.25ms elapsed=1.20s tid=0x02481c00 nid=0xf740 waiting on condition [0x00000000]
[2025-06-19T22:49:28.008Z] java.lang.Thread.State: RUNNABLE
[2025-06-19T22:49:28.008Z] No compile task
[2025-06-19T22:49:28.008Z]
[2025-06-19T22:49:28.008Z] "Sweeper thread" #8 daemon prio=9 os_prio=2 cpu=0.00ms elapsed=1.20s tid=0x25149400 nid=0x1e40 runnable [0x00000000]
[2025-06-19T22:49:28.008Z] java.lang.Thread.State: RUNNABLE
[2025-06-19T22:49:28.008Z]
[2025-06-19T22:49:28.008Z] "Common-Cleaner" #9 daemon prio=8 os_prio=1 cpu=0.00ms elapsed=1.16s tid=0x251d1c00 nid=0x10cf8 in Object.wait() [0x2570f000]
[2025-06-19T22:49:28.008Z] java.lang.Thread.State: TIMED_WAITING (on object monitor)
[2025-06-19T22:49:28.008Z] at java.lang.Object.wait(java.base@11.0.28-beta/Native Method)
[2025-06-19T22:49:28.008Z] - waiting on <0x04acf178> (a java.lang.ref.ReferenceQueue$Lock)
[2025-06-19T22:49:28.008Z] at java.lang.ref.ReferenceQueue.remove(java.base@11.0.28-beta/ReferenceQueue.java:155)
[2025-06-19T22:49:28.008Z] - waiting to re-lock in wait() <0x04acf178> (a java.lang.ref.ReferenceQueue$Lock)
[2025-06-19T22:49:28.008Z] at jdk.internal.ref.CleanerImpl.run(java.base@11.0.28-beta/CleanerImpl.java:148)
[2025-06-19T22:49:28.008Z] at java.lang.Thread.run(java.base@11.0.28-beta/Thread.java:829)
[2025-06-19T22:49:28.008Z] at jdk.internal.misc.InnocuousThread.run(java.base@11.0.28-beta/InnocuousThread.java:161)
[2025-06-19T22:49:28.008Z]
[2025-06-19T22:49:28.008Z] "MainThread" #10 prio=5 os_prio=0 cpu=250.00ms elapsed=1.08s tid=0x25290400 nid=0xd9d4 runnable [0x2579f000]
[2025-06-19T22:49:28.008Z] java.lang.Thread.State: RUNNABLE
[2025-06-19T22:49:28.008Z] at com.sun.javatest.regtest.agent.MainWrapper.handleTestException(MainWrapper.java:105)
[2025-06-19T22:49:28.008Z] at com.sun.javatest.regtest.agent.MainWrapper.access$000(MainWrapper.java:36)
[2025-06-19T22:49:28.008Z] at com.sun.javatest.regtest.agent.MainWrapper$MainTask.run(MainWrapper.java:147)
[2025-06-19T22:49:28.008Z] at java.lang.Thread.run(java.base@11.0.28-beta/Thread.java:829)
[2025-06-19T22:49:28.008Z]
[2025-06-19T22:49:28.008Z] "Thread-1" #11 prio=5 os_prio=0 cpu=15.62ms elapsed=1.06s tid=0x252b3800 nid=0x7630 waiting on condition [0x2582f000]
[2025-06-19T22:49:28.008Z] java.lang.Thread.State: RUNNABLE
[2025-06-19T22:49:28.008Z] at sun.hotspot.WhiteBox.handshakeWalkStack(Native Method)
[2025-06-19T22:49:28.008Z] at HandshakeWalkExitTest$1.run(HandshakeWalkExitTest.java:56)
[2025-06-19T22:49:28.008Z] at java.lang.Thread.run(java.base@11.0.28-beta/Thread.java:829)
[2025-06-19T22:49:28.008Z]
[2025-06-19T22:49:28.008Z] "main" #1 prio=5 os_prio=0 cpu=140.62ms elapsed=1.26s tid=0x023a4c00 nid=0xe8e4 in Object.wait() [0x022ff000]
[2025-06-19T22:49:28.008Z] java.lang.Thread.State: WAITING (on object monitor)
[2025-06-19T22:49:28.008Z] at java.lang.Object.wait(java.base@11.0.28-beta/Native Method)
[2025-06-19T22:49:28.008Z] - waiting on <0x04b47470> (a java.lang.Thread)
[2025-06-19T22:49:28.008Z] at java.lang.Thread.join(java.base@11.0.28-beta/Thread.java:1300)
[2025-06-19T22:49:28.008Z] - waiting to re-lock in wait() <0x04b47470> (a java.lang.Thread)
[2025-06-19T22:49:28.008Z] at java.lang.Thread.join(java.base@11.0.28-beta/Thread.java:1375)
[2025-06-19T22:49:28.008Z] at com.sun.javatest.regtest.agent.MainWrapper.main(MainWrapper.java:85)
[2025-06-19T22:49:28.008Z]
[2025-06-19T22:49:28.008Z] "Reference Handler" #2 daemon prio=10 os_prio=2 cpu=0.00ms elapsed=1.23s tid=0x0245b000 nid=0x7308 waiting on condition [0x24f7f000]
[2025-06-19T22:49:28.008Z] java.lang.Thread.State: RUNNABLE
[2025-06-19T22:49:28.008Z] at java.lang.ref.Reference.waitForReferencePendingList(java.base@11.0.28-beta/Native Method)
[2025-06-19T22:49:28.008Z] at java.lang.ref.Reference.processPendingReferences(java.base@11.0.28-beta/Reference.java:241)
[2025-06-19T22:49:28.008Z] at java.lang.ref.Reference$ReferenceHandler.run(java.base@11.0.28-beta/Reference.java:213)
[2025-06-19T22:49:28.009Z]
[2025-06-19T22:49:28.009Z] "Finalizer" #3 daemon prio=8 os_prio=1 cpu=0.00ms elapsed=1.23s tid=0x0245c800 nid=0x9ab0 in Object.wait() [0x2500f000]
[2025-06-19T22:49:28.009Z] java.lang.Thread.State: WAITING (on object monitor)
[2025-06-19T22:49:28.009Z] at java.lang.Object.wait(java.base@11.0.28-beta/Native Method)
[2025-06-19T22:49:28.009Z] - waiting on <0x04a07e98> (a java.lang.ref.ReferenceQueue$Lock)
[2025-06-19T22:49:28.009Z] at java.lang.ref.ReferenceQueue.remove(java.base@11.0.28-beta/ReferenceQueue.java:155)
[2025-06-19T22:49:28.009Z] - waiting to re-lock in wait() <0x04a07e98> (a java.lang.ref.ReferenceQueue$Lock)
[2025-06-19T22:49:28.009Z] at java.lang.ref.ReferenceQueue.remove(java.base@11.0.28-beta/ReferenceQueue.java:176)
[2025-06-19T22:49:28.009Z] at java.lang.ref.Finalizer$FinalizerThread.run(java.base@11.0.28-beta/Finalizer.java:170)
[2025-06-19T22:49:28.009Z]
[2025-06-19T22:49:28.009Z] "Signal Dispatcher" #4 daemon prio=9 os_prio=2 cpu=0.00ms elapsed=1.20s tid=0x0247f400 nid=0x3a54 runnable [0x00000000]
[2025-06-19T22:49:28.009Z] java.lang.Thread.State: RUNNABLE
[2025-06-19T22:49:28.009Z]
[2025-06-19T22:49:28.009Z] "Attach Listener" #5 daemon prio=5 os_prio=2 cpu=0.00ms elapsed=1.20s tid=0x02480000 nid=0x60a8 runnable [0x00000000]
[2025-06-19T22:49:28.009Z] java.lang.Thread.State: RUNNABLE
[2025-06-19T22:49:28.009Z]
[2025-06-19T22:49:28.009Z] "Service Thread" #6 daemon prio=9 os_prio=0 cpu=0.00ms elapsed=1.20s tid=0x02480c00 nid=0x28e8 runnable [0x00000000]
[2025-06-19T22:49:28.009Z] java.lang.Thread.State: RUNNABLE
[2025-06-19T22:49:28.009Z]
[2025-06-19T22:49:28.009Z] "C1 CompilerThread0" #7 daemon prio=9 os_prio=2 cpu=31.25ms elapsed=1.20s tid=0x02481c00 nid=0xf740 waiting on condition [0x00000000]
[2025-06-19T22:49:28.009Z] java.lang.Thread.State: RUNNABLE
[2025-06-19T22:49:28.009Z] No compile task
[2025-06-19T22:49:28.009Z]
[2025-06-19T22:49:28.009Z] "Sweeper thread" #8 daemon prio=9 os_prio=2 cpu=0.00ms elapsed=1.20s tid=0x25149400 nid=0x1e40 runnable [0x00000000]
[2025-06-19T22:49:28.009Z] java.lang.Thread.State: RUNNABLE
[2025-06-19T22:49:28.009Z]
[2025-06-19T22:49:28.009Z] "Common-Cleaner" #9 daemon prio=8 os_prio=1 cpu=0.00ms elapsed=1.16s tid=0x251d1c00 nid=0x10cf8 in Object.wait() [0x2570f000]
[2025-06-19T22:49:28.009Z] java.lang.Thread.State: TIMED_WAITING (on object monitor)
[2025-06-19T22:49:28.009Z] at java.lang.Object.wait(java.base@11.0.28-beta/Native Method)
[2025-06-19T22:49:28.009Z] - waiting on <0x04acf178> (a java.lang.ref.ReferenceQueue$Lock)
[2025-06-19T22:49:28.009Z] at java.lang.ref.ReferenceQueue.remove(java.base@11.0.28-beta/ReferenceQueue.java:155)
[2025-06-19T22:49:28.009Z] - waiting to re-lock in wait() <0x04acf178> (a java.lang.ref.ReferenceQueue$Lock)
[2025-06-19T22:49:28.009Z] at jdk.internal.ref.CleanerImpl.run(java.base@11.0.28-beta/CleanerImpl.java:148)
[2025-06-19T22:49:28.009Z] at java.lang.Thread.run(java.base@11.0.28-beta/Thread.java:829)
[2025-06-19T22:49:28.009Z] at jdk.internal.misc.InnocuousThread.run(java.base@11.0.28-beta/InnocuousThread.java:161)
[2025-06-19T22:49:28.009Z]
[2025-06-19T22:49:28.009Z] "MainThread" #10 prio=5 os_prio=0 cpu=250.00ms elapsed=1.08s tid=0x25290400 nid=0xd9d4 runnable [0x2579f000]
[2025-06-19T22:49:28.009Z] java.lang.Thread.State: RUNNABLE
[2025-06-19T22:49:28.009Z] at java.lang.Character.isWhitespace(java.base@11.0.28-beta/Character.java:10189)
[2025-06-19T22:49:28.009Z] at com.sun.javatest.regtest.agent.AStatus.normalize(AStatus.java:226)
[2025-06-19T22:49:28.009Z] at com.sun.javatest.regtest.agent.AStatus.<init>(AStatus.java:216)
[2025-06-19T22:49:28.009Z] at com.sun.javatest.regtest.agent.AStatus.failed(AStatus.java:55)
[2025-06-19T22:49:28.009Z] at com.sun.javatest.regtest.agent.MainWrapper.handleTestException(MainWrapper.java:105)
[2025-06-19T22:49:28.009Z] at com.sun.javatest.regtest.agent.MainWrapper.access$000(MainWrapper.java:36)
[2025-06-19T22:49:28.009Z] at com.sun.javatest.regtest.agent.MainWrapper$MainTask.run(MainWrapper.java:147)
[2025-06-19T22:49:28.009Z] at java.lang.Thread.run(java.base@11.0.28-beta/Thread.java:829)
[2025-06-19T22:49:28.009Z]
[2025-06-19T22:49:28.009Z] "Thread-1" #11 prio=5 os_prio=0 cpu=15.62ms elapsed=1.06s tid=0x252b3800 nid=0x7630 waiting on condition [0x2582f000]
[2025-06-19T22:49:28.009Z] java.lang.Thread.State: RUNNABLE
[2025-06-19T22:49:28.009Z] at sun.hotspot.WhiteBox.handshakeWalkStack(Native Method)
[2025-06-19T22:49:28.009Z] at HandshakeWalkExitTest$1.run(HandshakeWalkExitTest.java:56)
[2025-06-19T22:49:28.009Z] at java.lang.Thread.run(java.base@11.0.28-beta/Thread.java:829)
[2025-06-19T22:49:28.009Z]
[2025-06-19T22:49:28.009Z] "main" #1 prio=5 os_prio=0 cpu=140.62ms elapsed=1.26s tid=0x023a4c00 nid=0xe8e4 in Object.wait() [0x022ff000]
[2025-06-19T22:49:28.009Z] java.lang.Thread.State: WAITING (on object monitor)
[2025-06-19T22:49:28.009Z] at java.lang.Object.wait(java.base@11.0.28-beta/Native Method)
[2025-06-19T22:49:28.009Z] - waiting on <0x04b47470> (a java.lang.Thread)
[2025-06-19T22:49:28.009Z] at java.lang.Thread.join(java.base@11.0.28-beta/Thread.java:1300)
[2025-06-19T22:49:28.009Z] - waiting to re-lock in wait() <0x04b47470> (a java.lang.Thread)
[2025-06-19T22:49:28.009Z] at java.lang.Thread.join(java.base@11.0.28-beta/Thread.java:1375)
[2025-06-19T22:49:28.009Z] at com.sun.javatest.regtest.agent.MainWrapper.main(MainWrapper.java:85)
[2025-06-19T22:49:28.009Z]
[2025-06-19T22:49:28.009Z] "Reference Handler" #2 daemon prio=10 os_prio=2 cpu=0.00ms elapsed=1.24s tid=0x0245b000 nid=0x7308 waiting on condition [0x24f7f000]
[2025-06-19T22:49:28.009Z] java.lang.Thread.State: RUNNABLE
[2025-06-19T22:49:28.009Z] at java.lang.ref.Reference.waitForReferencePendingList(java.base@11.0.28-beta/Native Method)
[2025-06-19T22:49:28.009Z] at java.lang.ref.Reference.processPendingReferences(java.base@11.0.28-beta/Reference.java:241)
[2025-06-19T22:49:28.009Z] at java.lang.ref.Reference$ReferenceHandler.run(java.base@11.0.28-beta/Reference.java:213)
[2025-06-19T22:49:28.009Z]
[2025-06-19T22:49:28.009Z] "Finalizer" #3 daemon prio=8 os_prio=1 cpu=0.00ms elapsed=1.23s tid=0x0245c800 nid=0x9ab0 in Object.wait() [0x2500f000]
[2025-06-19T22:49:28.009Z] java.lang.Thread.State: WAITING (on object monitor)
[2025-06-19T22:49:28.009Z] at java.lang.Object.wait(java.base@11.0.28-beta/Native Method)
[2025-06-19T22:49:28.009Z] - waiting on <0x04a07e98> (a java.lang.ref.ReferenceQueue$Lock)
[2025-06-19T22:49:28.009Z] at java.lang.ref.ReferenceQueue.remove(java.base@11.0.28-beta/ReferenceQueue.java:155)
[2025-06-19T22:49:28.009Z] - waiting to re-lock in wait() <0x04a07e98> (a java.lang.ref.ReferenceQueue$Lock)
[2025-06-19T22:49:28.009Z] at java.lang.ref.ReferenceQueue.remove(java.base@11.0.28-beta/ReferenceQueue.java:176)
[2025-06-19T22:49:28.009Z] at java.lang.ref.Finalizer$FinalizerThread.run(java.base@11.0.28-beta/Finalizer.java:170)
[2025-06-19T22:49:28.009Z]
[2025-06-19T22:49:28.009Z] "Signal Dispatcher" #4 daemon prio=9 os_prio=2 cpu=0.00ms elapsed=1.21s tid=0x0247f400 nid=0x3a54 runnable [0x00000000]
[2025-06-19T22:49:28.009Z] java.lang.Thread.State: RUNNABLE
[2025-06-19T22:49:28.009Z]
[2025-06-19T22:49:28.009Z] "Attach Listener" #5 daemon prio=5 os_prio=2 cpu=0.00ms elapsed=1.21s tid=0x02480000 nid=0x60a8 runnable [0x00000000]
[2025-06-19T22:49:28.009Z] java.lang.Thread.State: RUNNABLE
[2025-06-19T22:49:28.009Z]
[2025-06-19T22:49:28.009Z] "Service Thread" #6 daemon prio=9 os_prio=0 cpu=0.00ms elapsed=1.21s tid=0x02480c00 nid=0x28e8 runnable [0x00000000]
[2025-06-19T22:49:28.009Z] java.lang.Thread.State: RUNNABLE
[2025-06-19T22:49:28.009Z]
[2025-06-19T22:49:28.009Z] "C1 CompilerThread0" #7 daemon prio=9 os_prio=2 cpu=31.25ms elapsed=1.21s tid=0x02481c00 nid=0xf740 waiting on condition [0x00000000]
[2025-06-19T22:49:28.009Z] java.lang.Thread.State: RUNNABLE
[2025-06-19T22:49:28.009Z] No compile task
[2025-06-19T22:49:28.009Z]
[2025-06-19T22:49:28.009Z] "Sweeper thread" #8 daemon prio=9 os_prio=2 cpu=0.00ms elapsed=1.20s tid=0x25149400 nid=0x1e40 runnable [0x00000000]
[2025-06-19T22:49:28.009Z] java.lang.Thread.State: RUNNABLE
[2025-06-19T22:49:28.009Z]
[2025-06-19T22:49:28.009Z] "Common-Cleaner" #9 daemon prio=8 os_prio=1 cpu=0.00ms elapsed=1.16s tid=0x251d1c00 nid=0x10cf8 in Object.wait() [0x2570f000]
[2025-06-19T22:49:28.009Z] java.lang.Thread.State: TIMED_WAITING (on object monitor)
[2025-06-19T22:49:28.009Z] at java.lang.Object.wait(java.base@11.0.28-beta/Native Method)
[2025-06-19T22:49:28.009Z] - waiting on <0x04acf178> (a java.lang.ref.ReferenceQueue$Lock)
[2025-06-19T22:49:28.009Z] at java.lang.ref.ReferenceQueue.remove(java.base@11.0.28-beta/ReferenceQueue.java:155)
[2025-06-19T22:49:28.009Z] - waiting to re-lock in wait() <0x04acf178> (a java.lang.ref.ReferenceQueue$Lock)
[2025-06-19T22:49:28.009Z] at jdk.internal.ref.CleanerImpl.run(java.base@11.0.28-beta/CleanerImpl.java:148)
[2025-06-19T22:49:28.009Z] at java.lang.Thread.run(java.base@11.0.28-beta/Thread.java:829)
[2025-06-19T22:49:28.009Z] at jdk.internal.misc.InnocuousThread.run(java.base@11.0.28-beta/InnocuousThread.java:161)
[2025-06-19T22:49:28.009Z]
[2025-06-19T22:49:28.009Z] "MainThread" #10 prio=5 os_prio=0 cpu=250.00ms elapsed=1.08s tid=0x25290400 nid=0xd9d4 runnable [0x2579f000]
[2025-06-19T22:49:28.009Z] java.lang.Thread.State: RUNNABLE
[2025-06-19T22:49:28.009Z] at sun.nio.cs.StreamEncoder.write(java.base@11.0.28-beta/StreamEncoder.java:125)
[2025-06-19T22:49:28.010Z] - locked <0x04a38e40> (a java.io.OutputStreamWriter)
[2025-06-19T22:49:28.010Z] at java.io.OutputStreamWriter.write(java.base@11.0.28-beta/OutputStreamWriter.java:208)
[2025-06-19T22:49:28.010Z] at java.io.BufferedWriter.flushBuffer(java.base@11.0.28-beta/BufferedWriter.java:120)
[2025-06-19T22:49:28.010Z] - locked <0x04a38e40> (a java.io.OutputStreamWriter)
[2025-06-19T22:49:28.010Z] at java.io.PrintStream.write(java.base@11.0.28-beta/PrintStream.java:605)
[2025-06-19T22:49:28.010Z] - locked <0x04a38d58> (a java.io.PrintStream)
[2025-06-19T22:49:28.010Z] at java.io.PrintStream.print(java.base@11.0.28-beta/PrintStream.java:745)
[2025-06-19T22:49:28.010Z] at com.sun.javatest.regtest.agent.AStatus.exit(AStatus.java:194)
[2025-06-19T22:49:28.010Z] at com.sun.javatest.regtest.agent.MainWrapper.handleTestException(MainWrapper.java:106)
[2025-06-19T22:49:28.010Z] at com.sun.javatest.regtest.agent.MainWrapper.access$000(MainWrapper.java:36)
[2025-06-19T22:49:28.010Z] at com.sun.javatest.regtest.agent.MainWrapper$MainTask.run(MainWrapper.java:147)
[2025-06-19T22:49:28.010Z] at java.lang.Thread.run(java.base@11.0.28-beta/Thread.java:829)
[2025-06-19T22:49:28.010Z]
[2025-06-19T22:49:28.010Z] "Thread-1" #11 prio=5 os_prio=0 cpu=15.62ms elapsed=1.07s tid=0x252b3800 nid=0x7630 runnable [0x2582f000]
[2025-06-19T22:49:28.010Z] java.lang.Thread.State: RUNNABLE
[2025-06-19T22:49:28.010Z] at sun.hotspot.WhiteBox.handshakeWalkStack(Native Method)
[2025-06-19T22:49:28.010Z] at HandshakeWalkExitTest$1.run(HandshakeWalkExitTest.java:56)
[2025-06-19T22:49:28.010Z] at java.lang.Thread.run(java.base@11.0.28-beta/Thread.java:829)
[2025-06-19T22:49:28.010Z]
[2025-06-19T22:49:28.010Z] "main" #1 prio=5 os_prio=0 cpu=140.62ms elapsed=1.26s tid=0x023a4c00 nid=0xe8e4 in Object.wait() [0x022ff000]
[2025-06-19T22:49:28.010Z] java.lang.Thread.State: WAITING (on object monitor)
[2025-06-19T22:49:28.010Z] at java.lang.Object.wait(java.base@11.0.28-beta/Native Method)
[2025-06-19T22:49:28.010Z] - waiting on <0x04b47470> (a java.lang.Thread)
[2025-06-19T22:49:28.010Z] at java.lang.Thread.join(java.base@11.0.28-beta/Thread.java:1300)
[2025-06-19T22:49:28.010Z] - waiting to re-lock in wait() <0x04b47470> (a java.lang.Thread)
[2025-06-19T22:49:28.010Z] at java.lang.Thread.join(java.base@11.0.28-beta/Thread.java:1375)
[2025-06-19T22:49:28.010Z] at com.sun.javatest.regtest.agent.MainWrapper.main(MainWrapper.java:85)
[2025-06-19T22:49:28.010Z]
[2025-06-19T22:49:28.010Z] "Reference Handler" #2 daemon prio=10 os_prio=2 cpu=0.00ms elapsed=1.24s tid=0x0245b000 nid=0x7308 waiting on condition [0x24f7f000]
[2025-06-19T22:49:28.010Z] java.lang.Thread.State: RUNNABLE
[2025-06-19T22:49:28.010Z] at java.lang.ref.Reference.waitForReferencePendingList(java.base@11.0.28-beta/Native Method)
[2025-06-19T22:49:28.010Z] at java.lang.ref.Reference.processPendingReferences(java.base@11.0.28-beta/Reference.java:241)
[2025-06-19T22:49:28.010Z] at java.lang.ref.Reference$ReferenceHandler.run(java.base@11.0.28-beta/Reference.java:213)
[2025-06-19T22:49:28.010Z]
[2025-06-19T22:49:28.010Z] "Finalizer" #3 daemon prio=8 os_prio=1 cpu=0.00ms elapsed=1.24s tid=0x0245c800 nid=0x9ab0 in Object.wait() [0x2500f000]
[2025-06-19T22:49:28.010Z] java.lang.Thread.State: WAITING (on object monitor)
[2025-06-19T22:49:28.010Z] at java.lang.Object.wait(java.base@11.0.28-beta/Native Method)
[2025-06-19T22:49:28.010Z] - waiting on <0x04a07e98> (a java.lang.ref.ReferenceQueue$Lock)
[2025-06-19T22:49:28.010Z] at java.lang.ref.ReferenceQueue.remove(java.base@11.0.28-beta/ReferenceQueue.java:155)
[2025-06-19T22:49:28.010Z] - waiting to re-lock in wait() <0x04a07e98> (a java.lang.ref.ReferenceQueue$Lock)
[2025-06-19T22:49:28.010Z] at java.lang.ref.ReferenceQueue.remove(java.base@11.0.28-beta/ReferenceQueue.java:176)
[2025-06-19T22:49:28.010Z] at java.lang.ref.Finalizer$FinalizerThread.run(java.base@11.0.28-beta/Finalizer.java:170)
[2025-06-19T22:49:28.010Z]
[2025-06-19T22:49:28.010Z] "Signal Dispatcher" #4 daemon prio=9 os_prio=2 cpu=0.00ms elapsed=1.21s tid=0x0247f400 nid=0x3a54 runnable [0x00000000]
[2025-06-19T22:49:28.010Z] java.lang.Thread.State: RUNNABLE
[2025-06-19T22:49:28.010Z]
[2025-06-19T22:49:28.010Z] "Attach Listener" #5 daemon prio=5 os_prio=2 cpu=0.00ms elapsed=1.21s tid=0x02480000 nid=0x60a8 runnable [0x00000000]
[2025-06-19T22:49:28.010Z] java.lang.Thread.State: RUNNABLE
[2025-06-19T22:49:28.010Z]
[2025-06-19T22:49:28.010Z] "Service Thread" #6 daemon prio=9 os_prio=0 cpu=0.00ms elapsed=1.21s tid=0x02480c00 nid=0x28e8 runnable [0x00000000]
[2025-06-19T22:49:28.010Z] java.lang.Thread.State: RUNNABLE
[2025-06-19T22:49:28.010Z]
[2025-06-19T22:49:28.010Z] "C1 CompilerThread0" #7 daemon prio=9 os_prio=2 cpu=31.25ms elapsed=1.21s tid=0x02481c00 nid=0xf740 waiting on condition [0x00000000]
[2025-06-19T22:49:28.010Z] java.lang.Thread.State: RUNNABLE
[2025-06-19T22:49:28.010Z] No compile task
[2025-06-19T22:49:28.010Z]
[2025-06-19T22:49:28.010Z] "Sweeper thread" #8 daemon prio=9 os_prio=2 cpu=0.00ms elapsed=1.20s tid=0x25149400 nid=0x1e40 runnable [0x00000000]
[2025-06-19T22:49:28.010Z] java.lang.Thread.State: RUNNABLE
[2025-06-19T22:49:28.010Z]
[2025-06-19T22:49:28.010Z] "Common-Cleaner" #9 daemon prio=8 os_prio=1 cpu=0.00ms elapsed=1.16s tid=0x251d1c00 nid=0x10cf8 in Object.wait() [0x2570f000]
[2025-06-19T22:49:28.010Z] java.lang.Thread.State: TIMED_WAITING (on object monitor)
[2025-06-19T22:49:28.010Z] at java.lang.Object.wait(java.base@11.0.28-beta/Native Method)
[2025-06-19T22:49:28.010Z] - waiting on <0x04acf178> (a java.lang.ref.ReferenceQueue$Lock)
[2025-06-19T22:49:28.010Z] at java.lang.ref.ReferenceQueue.remove(java.base@11.0.28-beta/ReferenceQueue.java:155)
[2025-06-19T22:49:28.010Z] - waiting to re-lock in wait() <0x04acf178> (a java.lang.ref.ReferenceQueue$Lock)
[2025-06-19T22:49:28.010Z] at jdk.internal.ref.CleanerImpl.run(java.base@11.0.28-beta/CleanerImpl.java:148)
[2025-06-19T22:49:28.010Z] at java.lang.Thread.run(java.base@11.0.28-beta/Thread.java:829)
[2025-06-19T22:49:28.010Z] at jdk.internal.misc.InnocuousThread.run(java.base@11.0.28-beta/InnocuousThread.java:161)
[2025-06-19T22:49:28.010Z]
[2025-06-19T22:49:28.010Z] "MainThread" #10 prio=5 os_prio=0 cpu=250.00ms elapsed=1.08s tid=0x25290400 nid=0xd9d4 runnable [0x2579f000]
[2025-06-19T22:49:28.010Z] java.lang.Thread.State: RUNNABLE
[2025-06-19T22:49:28.010Z] at java.lang.Runtime.exit(java.base@11.0.28-beta/Runtime.java:116)
[2025-06-19T22:49:28.010Z] at java.lang.System.exit(java.base@11.0.28-beta/System.java:1769)
[2025-06-19T22:49:28.010Z] at com.sun.javatest.regtest.agent.AStatus.exit(AStatus.java:198)
[2025-06-19T22:49:28.010Z] at com.sun.javatest.regtest.agent.MainWrapper.handleTestException(MainWrapper.java:106)
[2025-06-19T22:49:28.010Z] at com.sun.javatest.regtest.agent.MainWrapper.access$000(MainWrapper.java:36)
[2025-06-19T22:49:28.010Z] at com.sun.javatest.regtest.agent.MainWrapper$MainTask.run(MainWrapper.java:147)
[2025-06-19T22:49:28.010Z] at java.lang.Thread.run(java.base@11.0.28-beta/Thread.java:829)
[2025-06-19T22:49:28.010Z]
[2025-06-19T22:49:28.010Z] "Thread-1" #11 prio=5 os_prio=0 cpu=15.62ms elapsed=1.07s tid=0x252b3800 nid=0x7630 runnable [0x2582f000]
[2025-06-19T22:49:28.010Z] java.lang.Thread.State: RUNNABLE
[2025-06-19T22:49:28.010Z] at sun.hotspot.WhiteBox.handshakeWalkStack(Native Method)
[2025-06-19T22:49:28.010Z] at HandshakeWalkExitTest$1.run(HandshakeWalkExitTest.java:56)
[2025-06-19T22:49:28.010Z] at java.lang.Thread.run(java.base@11.0.28-beta/Thread.java:829)
[2025-06-19T22:49:28.010Z]
[2025-06-19T22:49:28.010Z] "main" #1 prio=5 os_prio=0 cpu=140.62ms elapsed=1.26s tid=0x023a4c00 nid=0xe8e4 in Object.wait() [0x022ff000]
[2025-06-19T22:49:28.010Z] java.lang.Thread.State: WAITING (on object monitor)
[2025-06-19T22:49:28.010Z] at java.lang.Object.wait(java.base@11.0.28-beta/Native Method)
[2025-06-19T22:49:28.010Z] - waiting on <0x04b47470> (a java.lang.Thread)
[2025-06-19T22:49:28.010Z] at java.lang.Thread.join(java.base@11.0.28-beta/Thread.java:1300)
[2025-06-19T22:49:28.010Z] - waiting to re-lock in wait() <0x04b47470> (a java.lang.Thread)
[2025-06-19T22:49:28.010Z] at java.lang.Thread.join(java.base@11.0.28-beta/Thread.java:1375)
[2025-06-19T22:49:28.010Z] at com.sun.javatest.regtest.agent.MainWrapper.main(MainWrapper.java:85)
[2025-06-19T22:49:28.010Z]
[2025-06-19T22:49:28.010Z] "Reference Handler" #2 daemon prio=10 os_prio=2 cpu=0.00ms elapsed=1.24s tid=0x0245b000 nid=0x7308 waiting on condition [0x24f7f000]
[2025-06-19T22:49:28.010Z] java.lang.Thread.State: RUNNABLE
[2025-06-19T22:49:28.010Z] at java.lang.ref.Reference.waitForReferencePendingList(java.base@11.0.28-beta/Native Method)
[2025-06-19T22:49:28.010Z] at java.lang.ref.Reference.processPendingReferences(java.base@11.0.28-beta/Reference.java:241)
[2025-06-19T22:49:28.010Z] at java.lang.ref.Reference$ReferenceHandler.run(java.base@11.0.28-beta/Reference.java:213)
[2025-06-19T22:49:28.010Z]
[2025-06-19T22:49:28.010Z] "Finalizer" #3 daemon prio=8 os_prio=1 cpu=0.00ms elapsed=1.24s tid=0x0245c800 nid=0x9ab0 in Object.wait() [0x2500f000]
[2025-06-19T22:49:28.011Z] java.lang.Thread.State: WAITING (on object monitor)
[2025-06-19T22:49:28.011Z] at java.lang.Object.wait(java.base@11.0.28-beta/Native Method)
[2025-06-19T22:49:28.011Z] - waiting on <0x04a07e98> (a java.lang.ref.ReferenceQueue$Lock)
[2025-06-19T22:49:28.011Z] at java.lang.ref.ReferenceQueue.remove(java.base@11.0.28-beta/ReferenceQueue.java:155)
[2025-06-19T22:49:28.011Z] - waiting to re-lock in wait() <0x04a07e98> (a java.lang.ref.ReferenceQueue$Lock)
[2025-06-19T22:49:28.011Z] at java.lang.ref.ReferenceQueue.remove(java.base@11.0.28-beta/ReferenceQueue.java:176)
[2025-06-19T22:49:28.011Z] at java.lang.ref.Finalizer$FinalizerThread.run(java.base@11.0.28-beta/Finalizer.java:170)
[2025-06-19T22:49:28.011Z]
[2025-06-19T22:49:28.011Z] "Signal Dispatcher" #4 daemon prio=9 os_prio=2 cpu=0.00ms elapsed=1.21s tid=0x0247f400 nid=0x3a54 runnable [0x00000000]
[2025-06-19T22:49:28.011Z] java.lang.Thread.State: RUNNABLE
[2025-06-19T22:49:28.011Z]
[2025-06-19T22:49:28.011Z] "Attach Listener" #5 daemon prio=5 os_prio=2 cpu=0.00ms elapsed=1.21s tid=0x02480000 nid=0x60a8 runnable [0x00000000]
[2025-06-19T22:49:28.011Z] java.lang.Thread.State: RUNNABLE
[2025-06-19T22:49:28.011Z]
[2025-06-19T22:49:28.011Z] "Service Thread" #6 daemon prio=9 os_prio=0 cpu=0.00ms elapsed=1.21s tid=0x02480c00 nid=0x28e8 runnable [0x00000000]
[2025-06-19T22:49:28.011Z] java.lang.Thread.State: RUNNABLE
[2025-06-19T22:49:28.011Z]
[2025-06-19T22:49:28.011Z] "C1 CompilerThread0" #7 daemon prio=9 os_prio=2 cpu=31.25ms elapsed=1.21s tid=0x02481c00 nid=0xf740 waiting on condition [0x00000000]
[2025-06-19T22:49:28.011Z] java.lang.Thread.State: RUNNABLE
[2025-06-19T22:49:28.011Z] No compile task
[2025-06-19T22:49:28.011Z]
[2025-06-19T22:49:28.011Z] "Sweeper thread" #8 daemon prio=9 os_prio=2 cpu=0.00ms elapsed=1.20s tid=0x25149400 nid=0x1e40 runnable [0x00000000]
[2025-06-19T22:49:28.011Z] java.lang.Thread.State: RUNNABLE
[2025-06-19T22:49:28.011Z]
[2025-06-19T22:49:28.011Z] "Common-Cleaner" #9 daemon prio=8 os_prio=1 cpu=0.00ms elapsed=1.16s tid=0x251d1c00 nid=0x10cf8 in Object.wait() [0x2570f000]
[2025-06-19T22:49:28.011Z] java.lang.Thread.State: TIMED_WAITING (on object monitor)
[2025-06-19T22:49:28.011Z] at java.lang.Object.wait(java.base@11.0.28-beta/Native Method)
[2025-06-19T22:49:28.011Z] - waiting on <0x04acf178> (a java.lang.ref.ReferenceQueue$Lock)
[2025-06-19T22:49:28.011Z] at java.lang.ref.ReferenceQueue.remove(java.base@11.0.28-beta/ReferenceQueue.java:155)
[2025-06-19T22:49:28.011Z] - waiting to re-lock in wait() <0x04acf178> (a java.lang.ref.ReferenceQueue$Lock)
[2025-06-19T22:49:28.011Z] at jdk.internal.ref.CleanerImpl.run(java.base@11.0.28-beta/CleanerImpl.java:148)
[2025-06-19T22:49:28.011Z] at java.lang.Thread.run(java.base@11.0.28-beta/Thread.java:829)
[2025-06-19T22:49:28.011Z] at jdk.internal.misc.InnocuousThread.run(java.base@11.0.28-beta/InnocuousThread.java:161)
[2025-06-19T22:49:28.011Z]
[2025-06-19T22:49:28.011Z] "MainThread" #10 prio=5 os_prio=0 cpu=250.00ms elapsed=1.08s tid=0x25290400 nid=0xd9d4 runnable [0x2579f000]
[2025-06-19T22:49:28.011Z] java.lang.Thread.State: RUNNABLE
[2025-06-19T22:49:28.011Z] at java.lang.Shutdown.halt0(java.base@11.0.28-beta/Native Method)
[2025-06-19T22:49:28.011Z] at java.lang.Shutdown.halt(java.base@11.0.28-beta/Shutdown.java:152)
[2025-06-19T22:49:28.011Z] - locked <0x04cd4040> (a java.lang.Shutdown$Lock)
[2025-06-19T22:49:28.011Z] at java.lang.Shutdown.exit(java.base@11.0.28-beta/Shutdown.java:175)
[2025-06-19T22:49:28.011Z] - locked <0x04cd3ee8> (a java.lang.Class for java.lang.Shutdown)
[2025-06-19T22:49:28.011Z] at java.lang.Runtime.exit(java.base@11.0.28-beta/Runtime.java:116)
[2025-06-19T22:49:28.011Z] at java.lang.System.exit(java.base@11.0.28-beta/System.java:1769)
[2025-06-19T22:49:28.011Z] at com.sun.javatest.regtest.agent.AStatus.exit(AStatus.java:198)
[2025-06-19T22:49:28.011Z] at com.sun.javatest.regtest.agent.MainWrapper.handleTestException(MainWrapper.java:106)
[2025-06-19T22:49:28.011Z] at com.sun.javatest.regtest.agent.MainWrapper.access$000(MainWrapper.java:36)
[2025-06-19T22:49:28.011Z] at com.sun.javatest.regtest.agent.MainWrapper$MainTask.run(MainWrapper.java:147)
[2025-06-19T22:49:28.011Z] at java.lang.Thread.run(java.base@11.0.28-beta/Thread.java:829)
[2025-06-19T22:49:28.011Z]
[2025-06-19T22:49:28.011Z] "Thread-1" #11 prio=5 os_prio=0 cpu=15.62ms elapsed=1.07s tid=0x252b3800 nid=0x7630 runnable [0x2582f000]
[2025-06-19T22:49:28.011Z] java.lang.Thread.State: RUNNABLE
[2025-06-19T22:49:28.011Z] at sun.hotspot.WhiteBox.handshakeWalkStack(Native Method)
[2025-06-19T22:49:28.011Z] at HandshakeWalkExitTest$1.run(HandshakeWalkExitTest.java:56)
[2025-06-19T22:49:28.011Z] at java.lang.Thread.run(java.base@11.0.28-beta/Thread.java:829)
[2025-06-19T22:49:28.011Z]
[2025-06-19T22:49:28.011Z] STDERR:
[2025-06-19T22:49:28.011Z] java.lang.OutOfMemoryError: unable to create native thread: possibly out of memory or process/resource limits reached
[2025-06-19T22:49:28.011Z] at java.base/java.lang.Thread.start0(Native Method)
[2025-06-19T22:49:28.011Z] at java.base/java.lang.Thread.start(Thread.java:798)
[2025-06-19T22:49:28.011Z] at HandshakeWalkExitTest.main(HandshakeWalkExitTest.java:66)
[2025-06-19T22:49:28.011Z] at java.base/jdk.internal.reflect.NativeMethodAccessorImpl.invoke0(Native Method)
[2025-06-19T22:49:28.011Z] at java.base/jdk.internal.reflect.NativeMethodAccessorImpl.invoke(NativeMethodAccessorImpl.java:62)
[2025-06-19T22:49:28.011Z] at java.base/jdk.internal.reflect.DelegatingMethodAccessorImpl.invoke(DelegatingMethodAccessorImpl.java:43)
[2025-06-19T22:49:28.011Z] at java.base/java.lang.reflect.Method.invoke(Method.java:566)
[2025-06-19T22:49:28.011Z] at com.sun.javatest.regtest.agent.MainWrapper$MainTask.run(MainWrapper.java:138)
[2025-06-19T22:49:28.011Z] at java.base/java.lang.Thread.run(Thread.java:829)
[2025-06-19T22:49:28.011Z]
[2025-06-19T22:49:28.011Z] JavaTest Message: Test threw exception: java.lang.OutOfMemoryError: unable to create native thread: possibly out of memory or process/resource limits reached
[2025-06-19T22:49:28.011Z] JavaTest Message: shutting down test
[2025-06-19T22:49:28.011Z]
[2025-06-19T22:49:28.011Z] STATUS:Failed.`main' threw exception: java.lang.OutOfMemoryError: unable to create native thread: possibly out of memory or process/resource limits reached
[2025-06-19T22:49:28.011Z] rerun:
[2025-06-19T22:49:28.011Z] cd 'C:\jenkins\workspace\Test_openjdk11_hs_extended.openjdk_x86-32_windows_testList_1\aqa-tests\TKG\output_1750365128106\hotspot_runtime_0\work\scratch\0' && \
[2025-06-19T22:49:28.011Z] PATH='C:\Program Files\Java\jdk-17.0.13+11\bin;C:\cygwin64\bin;C:\Windows\system32;C:\Windows;C:\Windows\System32\Wbem;C:\Windows\System32\WindowsPowerShell\v1.0;C:\Windows\System32\OpenSSH;C:\Program Files\dotnet;C:\Users\adoptopenjdk\AppData\Local\Microsoft\WindowsApps;C:\Strawberry\perl\bin;C:\Program Files\Git\cmd;C:\openjdk\jdk-8\bin;C:\apache-ant\apache-ant-1.10.15\bin;C:\Program Files (x86)\IncrediBuild;C:\Program Files (x86)\Windows Kits\10\Windows Performance Toolkit;C:\rust\bin;C:\Program Files\IcedTeaWEB\bin;C:\Users\jenkins\AppData\Local\Microsoft\WindowsApps' \
[2025-06-19T22:49:28.011Z] SystemDrive=C: \
[2025-06-19T22:49:28.011Z] SystemRoot='C:\Windows' \
[2025-06-19T22:49:28.011Z] TEMP='C:\Users\jenkins\AppData\Local\Temp\2' \
[2025-06-19T22:49:28.011Z] TMP='C:\Users\jenkins\AppData\Local\Temp\2' \
[2025-06-19T22:49:28.011Z] windir='C:\Windows' \
[2025-06-19T22:49:28.011Z] CLASSPATH='C:\jenkins\workspace\Test_openjdk11_hs_extended.openjdk_x86-32_windows_testList_1\aqa-tests\TKG\output_1750365128106\hotspot_runtime_0\work\classes\1\runtime\handshake\HandshakeWalkExitTest.d;C:\jenkins\workspace\Test_openjdk11_hs_extended.openjdk_x86-32_windows_testList_1\aqa-tests\openjdk\openjdk-jdk\test\hotspot\jtreg\runtime\handshake;C:\jenkins\workspace\Test_openjdk11_hs_extended.openjdk_x86-32_windows_testList_1\aqa-tests\TKG\output_1750365128106\hotspot_runtime_0\work\classes\1\testlibrary;C:\jenkins\workspace\Test_openjdk11_hs_extended.openjdk_x86-32_windows_testList_1\aqa-tests\openjdk\openjdk-jdk\test\hotspot\jtreg\testlibrary;C:\jenkins\workspace\Test_openjdk11_hs_extended.openjdk_x86-32_windows_testList_1\aqa-tests\TKG\output_1750365128106\hotspot_runtime_0\work\classes\1\test\lib;C:\jenkins\workspace\Test_openjdk11_hs_extended.openjdk_x86-32_windows_testList_1\aqa-tests\openjdk\openjdk-jdk\test\lib;C:\jenkins\workspace\Test_openjdk11_hs_extended.openjdk_x86-32_windows_testList_1\jvmtest\openjdk\jtreg\lib\javatest.jar;C:\jenkins\workspace\Test_openjdk11_hs_extended.openjdk_x86-32_windows_testList_1\jvmtest\openjdk\jtreg\lib\jtreg.jar' \
[2025-06-19T22:49:28.011Z] 'c:\jenkins\workspace\Test_openjdk11_hs_extended.openjdk_x86-32_windows_testList_1\jdkbinary\j2sdk-image\bin\java' \
[2025-06-19T22:49:28.011Z] -Dtest.vm.opts='-ea -esa -Xmx512m' \
[2025-06-19T22:49:28.011Z] -Dtest.tool.vm.opts='-J-ea -J-esa -J-Xmx512m' \
[2025-06-19T22:49:28.011Z] -Dtest.compiler.opts= \
[2025-06-19T22:49:28.011Z] -Dtest.java.opts= \
[2025-06-19T22:49:28.011Z] -Dtest.jdk='c:\jenkins\workspace\Test_openjdk11_hs_extended.openjdk_x86-32_windows_testList_1\jdkbinary\j2sdk-image' \
[2025-06-19T22:49:28.011Z] -Dcompile.jdk='c:\jenkins\workspace\Test_openjdk11_hs_extended.openjdk_x86-32_windows_testList_1\jdkbinary\j2sdk-image' \
[2025-06-19T22:49:28.011Z] -Dtest.timeout.factor=8.0 \
[2025-06-19T22:49:28.011Z] -Dtest.nativepath='c:\jenkins\workspace\Test_openjdk11_hs_extended.openjdk_x86-32_windows_testList_1\jdkbinary\openjdk-test-image\hotspot\jtreg\native' \
[2025-06-19T22:49:28.011Z] -Dtest.root='C:\jenkins\workspace\Test_openjdk11_hs_extended.openjdk_x86-32_windows_testList_1\aqa-tests\openjdk\openjdk-jdk\test\hotspot\jtreg' \
[2025-06-19T22:49:28.011Z] -Dtest.name=runtime/handshake/HandshakeWalkExitTest.java \
[2025-06-19T22:49:28.011Z] -Dtest.file='C:\jenkins\workspace\Test_openjdk11_hs_extended.openjdk_x86-32_windows_testList_1\aqa-tests\openjdk\openjdk-jdk\test\hotspot\jtreg\runtime\handshake\HandshakeWalkExitTest.java' \
[2025-06-19T22:49:28.011Z] -Dtest.src='C:\jenkins\workspace\Test_openjdk11_hs_extended.openjdk_x86-32_windows_testList_1\aqa-tests\openjdk\openjdk-jdk\test\hotspot\jtreg\runtime\handshake' \
[2025-06-19T22:49:28.011Z] -Dtest.src.path='C:\jenkins\workspace\Test_openjdk11_hs_extended.openjdk_x86-32_windows_testList_1\aqa-tests\openjdk\openjdk-jdk\test\hotspot\jtreg\runtime\handshake;C:\jenkins\workspace\Test_openjdk11_hs_extended.openjdk_x86-32_windows_testList_1\aqa-tests\openjdk\openjdk-jdk\test\hotspot\jtreg\testlibrary;C:\jenkins\workspace\Test_openjdk11_hs_extended.openjdk_x86-32_windows_testList_1\aqa-tests\openjdk\openjdk-jdk\test\lib' \
[2025-06-19T22:49:28.012Z] -Dtest.classes='C:\jenkins\workspace\Test_openjdk11_hs_extended.openjdk_x86-32_windows_testList_1\aqa-tests\TKG\output_1750365128106\hotspot_runtime_0\work\classes\1\runtime\handshake\HandshakeWalkExitTest.d' \
[2025-06-19T22:49:28.012Z] -Dtest.class.path='C:\jenkins\workspace\Test_openjdk11_hs_extended.openjdk_x86-32_windows_testList_1\aqa-tests\TKG\output_1750365128106\hotspot_runtime_0\work\classes\1\runtime\handshake\HandshakeWalkExitTest.d;C:\jenkins\workspace\Test_openjdk11_hs_extended.openjdk_x86-32_windows_testList_1\aqa-tests\TKG\output_1750365128106\hotspot_runtime_0\work\classes\1\testlibrary;C:\jenkins\workspace\Test_openjdk11_hs_extended.openjdk_x86-32_windows_testList_1\aqa-tests\TKG\output_1750365128106\hotspot_runtime_0\work\classes\1\test\lib' \
[2025-06-19T22:49:28.012Z] -Dtest.class.path.prefix='C:\jenkins\workspace\Test_openjdk11_hs_extended.openjdk_x86-32_windows_testList_1\aqa-tests\TKG\output_1750365128106\hotspot_runtime_0\work\classes\1\runtime\handshake\HandshakeWalkExitTest.d;C:\jenkins\workspace\Test_openjdk11_hs_extended.openjdk_x86-32_windows_testList_1\aqa-tests\openjdk\openjdk-jdk\test\hotspot\jtreg\runtime\handshake;C:\jenkins\workspace\Test_openjdk11_hs_extended.openjdk_x86-32_windows_testList_1\aqa-tests\TKG\output_1750365128106\hotspot_runtime_0\work\classes\1\testlibrary;C:\jenkins\workspace\Test_openjdk11_hs_extended.openjdk_x86-32_windows_testList_1\aqa-tests\TKG\output_1750365128106\hotspot_runtime_0\work\classes\1\test\lib' \
[2025-06-19T22:49:28.012Z] -ea \
[2025-06-19T22:49:28.012Z] -esa \
[2025-06-19T22:49:28.012Z] -Xmx512m \
[2025-06-19T22:49:28.012Z] '-Djava.library.path=c:\jenkins\workspace\Test_openjdk11_hs_extended.openjdk_x86-32_windows_testList_1\jdkbinary\openjdk-test-image\hotspot\jtreg\native' \
[2025-06-19T22:49:28.012Z] -Xbootclasspath/a:. \
[2025-06-19T22:49:28.012Z] -XX:+UnlockDiagnosticVMOptions \
[2025-06-19T22:49:28.012Z] -XX:+WhiteBoxAPI \
[2025-06-19T22:49:28.012Z] com.sun.javatest.regtest.agent.MainWrapper 'C:\jenkins\workspace\Test_openjdk11_hs_extended.openjdk_x86-32_windows_testList_1\aqa-tests\TKG\output_1750365128106\hotspot_runtime_0\work\runtime\handshake\HandshakeWalkExitTest.d\main.0.jta'
[2025-06-19T22:49:28.012Z]
[2025-06-19T22:49:28.012Z] TEST RESULT: Failed. Execution failed: `main' threw exception: java.lang.OutOfMemoryError: unable to create native thread: possibly out of memory or process/resource limits reached
[2025-06-19T22:49:28.012Z] --------------------------------------------------
[2025-06-19T22:49:28.012Z] TEST: runtime/handshake/HandshakeWalkOneExitTest.java
[2025-06-19T22:49:28.012Z] TEST JDK: c:\jenkins\workspace\Test_openjdk11_hs_extended.openjdk_x86-32_windows_testList_1\jdkbinary\j2sdk-image
[2025-06-19T22:49:28.012Z]
[2025-06-19T22:49:28.012Z] ACTION: build -- Passed. Build successful
[2025-06-19T22:49:28.012Z] REASON: User specified action: run build HandshakeWalkOneExitTest
[2025-06-19T22:49:28.012Z] TIME: 0.111 seconds
[2025-06-19T22:49:28.012Z] messages:
[2025-06-19T22:49:28.012Z] command: build HandshakeWalkOneExitTest
[2025-06-19T22:49:28.012Z] reason: User specified action: run build HandshakeWalkOneExitTest
[2025-06-19T22:49:28.012Z] started: Thu Jun 19 22:49:19 GMT 2025
[2025-06-19T22:49:28.012Z] Test directory:
[2025-06-19T22:49:28.012Z] compile: HandshakeWalkOneExitTest
[2025-06-19T22:49:28.012Z] finished: Thu Jun 19 22:49:20 GMT 2025
[2025-06-19T22:49:28.012Z] elapsed time (seconds): 0.111
[2025-06-19T22:49:28.012Z]
[2025-06-19T22:49:28.012Z] ACTION: compile -- Passed. Compilation successful
[2025-06-19T22:49:28.012Z] REASON: .class file out of date or does not exist
[2025-06-19T22:49:28.012Z] TIME: 0.109 seconds
[2025-06-19T22:49:28.012Z] messages:
[2025-06-19T22:49:28.012Z] command: compile C:\jenkins\workspace\Test_openjdk11_hs_extended.openjdk_x86-32_windows_testList_1\aqa-tests\openjdk\openjdk-jdk\test\hotspot\jtreg\runtime\handshake\HandshakeWalkOneExitTest.java
[2025-06-19T22:49:28.012Z] reason: .class file out of date or does not exist
[2025-06-19T22:49:28.012Z] started: Thu Jun 19 22:49:19 GMT 2025
[2025-06-19T22:49:28.012Z] Mode: agentvm
[2025-06-19T22:49:28.012Z] Agent id: 2
[2025-06-19T22:49:28.012Z] finished: Thu Jun 19 22:49:20 GMT 2025
[2025-06-19T22:49:28.012Z] elapsed time (seconds): 0.109
[2025-06-19T22:49:28.012Z] configuration:
[2025-06-19T22:49:28.012Z] Boot Layer (javac runtime environment)
[2025-06-19T22:49:28.012Z] class path: C:\jenkins\workspace\Test_openjdk11_hs_extended.openjdk_x86-32_windows_testList_1\jvmtest\openjdk\jtreg\lib\javatest.jar
[2025-06-19T22:49:28.012Z] C:\jenkins\workspace\Test_openjdk11_hs_extended.openjdk_x86-32_windows_testList_1\jvmtest\openjdk\jtreg\lib\jtreg.jar
[2025-06-19T22:49:28.012Z] patch: java.base C:\jenkins\workspace\Test_openjdk11_hs_extended.openjdk_x86-32_windows_testList_1\aqa-tests\TKG\output_1750365128106\hotspot_runtime_0\work\patches\java.base
[2025-06-19T22:49:28.012Z]
[2025-06-19T22:49:28.012Z] javac compilation environment
[2025-06-19T22:49:28.012Z] source path: C:\jenkins\workspace\Test_openjdk11_hs_extended.openjdk_x86-32_windows_testList_1\aqa-tests\openjdk\openjdk-jdk\test\hotspot\jtreg\runtime\handshake
[2025-06-19T22:49:28.012Z] C:\jenkins\workspace\Test_openjdk11_hs_extended.openjdk_x86-32_windows_testList_1\aqa-tests\openjdk\openjdk-jdk\test\hotspot\jtreg\testlibrary
[2025-06-19T22:49:28.012Z] C:\jenkins\workspace\Test_openjdk11_hs_extended.openjdk_x86-32_windows_testList_1\aqa-tests\openjdk\openjdk-jdk\test\lib
[2025-06-19T22:49:28.012Z] class path: C:\jenkins\workspace\Test_openjdk11_hs_extended.openjdk_x86-32_windows_testList_1\aqa-tests\openjdk\openjdk-jdk\test\hotspot\jtreg\runtime\handshake
[2025-06-19T22:49:28.012Z] C:\jenkins\workspace\Test_openjdk11_hs_extended.openjdk_x86-32_windows_testList_1\aqa-tests\TKG\output_1750365128106\hotspot_runtime_0\work\classes\0\runtime\handshake\HandshakeWalkOneExitTest.d
[2025-06-19T22:49:28.012Z] C:\jenkins\workspace\Test_openjdk11_hs_extended.openjdk_x86-32_windows_testList_1\aqa-tests\TKG\output_1750365128106\hotspot_runtime_0\work\classes\0\testlibrary
[2025-06-19T22:49:28.012Z] C:\jenkins\workspace\Test_openjdk11_hs_extended.openjdk_x86-32_windows_testList_1\aqa-tests\TKG\output_1750365128106\hotspot_runtime_0\work\classes\0\test\lib
[2025-06-19T22:49:28.012Z]
[2025-06-19T22:49:28.012Z] rerun:
[2025-06-19T22:49:28.012Z] cd 'C:\jenkins\workspace\Test_openjdk11_hs_extended.openjdk_x86-32_windows_testList_1\aqa-tests\TKG\output_1750365128106\hotspot_runtime_0\work\scratch\1' && \
[2025-06-19T22:49:28.012Z] PATH='C:\Program Files\Java\jdk-17.0.13+11\bin;C:\cygwin64\bin;C:\Windows\system32;C:\Windows;C:\Windows\System32\Wbem;C:\Windows\System32\WindowsPowerShell\v1.0;C:\Windows\System32\OpenSSH;C:\Program Files\dotnet;C:\Users\adoptopenjdk\AppData\Local\Microsoft\WindowsApps;C:\Strawberry\perl\bin;C:\Program Files\Git\cmd;C:\openjdk\jdk-8\bin;C:\apache-ant\apache-ant-1.10.15\bin;C:\Program Files (x86)\IncrediBuild;C:\Program Files (x86)\Windows Kits\10\Windows Performance Toolkit;C:\rust\bin;C:\Program Files\IcedTeaWEB\bin;C:\Users\jenkins\AppData\Local\Microsoft\WindowsApps' \
[2025-06-19T22:49:28.012Z] SystemDrive=C: \
[2025-06-19T22:49:28.012Z] SystemRoot='C:\Windows' \
[2025-06-19T22:49:28.012Z] TEMP='C:\Users\jenkins\AppData\Local\Temp\2' \
[2025-06-19T22:49:28.012Z] TMP='C:\Users\jenkins\AppData\Local\Temp\2' \
[2025-06-19T22:49:28.012Z] windir='C:\Windows' \
[2025-06-19T22:49:28.012Z] 'c:\jenkins\workspace\Test_openjdk11_hs_extended.openjdk_x86-32_windows_testList_1\jdkbinary\j2sdk-image\bin\javac' \
[2025-06-19T22:49:28.012Z] -J-ea \
[2025-06-19T22:49:28.012Z] -J-esa \
[2025-06-19T22:49:28.012Z] -J-Xmx512m \
[2025-06-19T22:49:28.012Z] -J-Dtest.vm.opts='-ea -esa -Xmx512m' \
[2025-06-19T22:49:28.012Z] -J-Dtest.tool.vm.opts='-J-ea -J-esa -J-Xmx512m' \
[2025-06-19T22:49:28.012Z] -J-Dtest.compiler.opts= \
[2025-06-19T22:49:28.012Z] -J-Dtest.java.opts= \
[2025-06-19T22:49:28.012Z] -J-Dtest.jdk='c:\jenkins\workspace\Test_openjdk11_hs_extended.openjdk_x86-32_windows_testList_1\jdkbinary\j2sdk-image' \
[2025-06-19T22:49:28.012Z] -J-Dcompile.jdk='c:\jenkins\workspace\Test_openjdk11_hs_extended.openjdk_x86-32_windows_testList_1\jdkbinary\j2sdk-image' \
[2025-06-19T22:49:28.012Z] -J-Dtest.timeout.factor=8.0 \
[2025-06-19T22:49:28.012Z] -J-Dtest.nativepath='c:\jenkins\workspace\Test_openjdk11_hs_extended.openjdk_x86-32_windows_testList_1\jdkbinary\openjdk-test-image\hotspot\jtreg\native' \
[2025-06-19T22:49:28.012Z] -J-Dtest.root='C:\jenkins\workspace\Test_openjdk11_hs_extended.openjdk_x86-32_windows_testList_1\aqa-tests\openjdk\openjdk-jdk\test\hotspot\jtreg' \
[2025-06-19T22:49:28.012Z] -J-Dtest.name=runtime/handshake/HandshakeWalkOneExitTest.java \
[2025-06-19T22:49:28.012Z] -J-Dtest.file='C:\jenkins\workspace\Test_openjdk11_hs_extended.openjdk_x86-32_windows_testList_1\aqa-tests\openjdk\openjdk-jdk\test\hotspot\jtreg\runtime\handshake\HandshakeWalkOneExitTest.java' \
[2025-06-19T22:49:28.012Z] -J-Dtest.src='C:\jenkins\workspace\Test_openjdk11_hs_extended.openjdk_x86-32_windows_testList_1\aqa-tests\openjdk\openjdk-jdk\test\hotspot\jtreg\runtime\handshake' \
[2025-06-19T22:49:28.012Z] -J-Dtest.src.path='C:\jenkins\workspace\Test_openjdk11_hs_extended.openjdk_x86-32_windows_testList_1\aqa-tests\openjdk\openjdk-jdk\test\hotspot\jtreg\runtime\handshake;C:\jenkins\workspace\Test_openjdk11_hs_extended.openjdk_x86-32_windows_testList_1\aqa-tests\openjdk\openjdk-jdk\test\hotspot\jtreg\testlibrary;C:\jenkins\workspace\Test_openjdk11_hs_extended.openjdk_x86-32_windows_testList_1\aqa-tests\openjdk\openjdk-jdk\test\lib' \
[2025-06-19T22:49:28.012Z] -J-Dtest.classes='C:\jenkins\workspace\Test_openjdk11_hs_extended.openjdk_x86-32_windows_testList_1\aqa-tests\TKG\output_1750365128106\hotspot_runtime_0\work\classes\0\runtime\handshake\HandshakeWalkOneExitTest.d' \
[2025-06-19T22:49:28.012Z] -J-Dtest.class.path='C:\jenkins\workspace\Test_openjdk11_hs_extended.openjdk_x86-32_windows_testList_1\aqa-tests\TKG\output_1750365128106\hotspot_runtime_0\work\classes\0\runtime\handshake\HandshakeWalkOneExitTest.d;C:\jenkins\workspace\Test_openjdk11_hs_extended.openjdk_x86-32_windows_testList_1\aqa-tests\TKG\output_1750365128106\hotspot_runtime_0\work\classes\0\testlibrary;C:\jenkins\workspace\Test_openjdk11_hs_extended.openjdk_x86-32_windows_testList_1\aqa-tests\TKG\output_1750365128106\hotspot_runtime_0\work\classes\0\test\lib' \
[2025-06-19T22:49:28.012Z] -J-Dtest.class.path.prefix='C:\jenkins\workspace\Test_openjdk11_hs_extended.openjdk_x86-32_windows_testList_1\aqa-tests\TKG\output_1750365128106\hotspot_runtime_0\work\classes\0\runtime\handshake\HandshakeWalkOneExitTest.d;C:\jenkins\workspace\Test_openjdk11_hs_extended.openjdk_x86-32_windows_testList_1\aqa-tests\openjdk\openjdk-jdk\test\hotspot\jtreg\runtime\handshake;C:\jenkins\workspace\Test_openjdk11_hs_extended.openjdk_x86-32_windows_testList_1\aqa-tests\TKG\output_1750365128106\hotspot_runtime_0\work\classes\0\testlibrary;C:\jenkins\workspace\Test_openjdk11_hs_extended.openjdk_x86-32_windows_testList_1\aqa-tests\TKG\output_1750365128106\hotspot_runtime_0\work\classes\0\test\lib' \
[2025-06-19T22:49:28.012Z] -d 'C:\jenkins\workspace\Test_openjdk11_hs_extended.openjdk_x86-32_windows_testList_1\aqa-tests\TKG\output_1750365128106\hotspot_runtime_0\work\classes\0\runtime\handshake\HandshakeWalkOneExitTest.d' \
[2025-06-19T22:49:28.012Z] -sourcepath 'C:\jenkins\workspace\Test_openjdk11_hs_extended.openjdk_x86-32_windows_testList_1\aqa-tests\openjdk\openjdk-jdk\test\hotspot\jtreg\runtime\handshake;C:\jenkins\workspace\Test_openjdk11_hs_extended.openjdk_x86-32_windows_testList_1\aqa-tests\openjdk\openjdk-jdk\test\hotspot\jtreg\testlibrary;C:\jenkins\workspace\Test_openjdk11_hs_extended.openjdk_x86-32_windows_testList_1\aqa-tests\openjdk\openjdk-jdk\test\lib' \
[2025-06-19T22:49:28.012Z] -classpath 'C:\jenkins\workspace\Test_openjdk11_hs_extended.openjdk_x86-32_windows_testList_1\aqa-tests\openjdk\openjdk-jdk\test\hotspot\jtreg\runtime\handshake;C:\jenkins\workspace\Test_openjdk11_hs_extended.openjdk_x86-32_windows_testList_1\aqa-tests\TKG\output_1750365128106\hotspot_runtime_0\work\classes\0\runtime\handshake\HandshakeWalkOneExitTest.d;C:\jenkins\workspace\Test_openjdk11_hs_extended.openjdk_x86-32_windows_testList_1\aqa-tests\TKG\output_1750365128106\hotspot_runtime_0\work\classes\0\testlibrary;C:\jenkins\workspace\Test_openjdk11_hs_extended.openjdk_x86-32_windows_testList_1\aqa-tests\TKG\output_1750365128106\hotspot_runtime_0\work\classes\0\test\lib' 'C:\jenkins\workspace\Test_openjdk11_hs_extended.openjdk_x86-32_windows_testList_1\aqa-tests\openjdk\openjdk-jdk\test\hotspot\jtreg\runtime\handshake\HandshakeWalkOneExitTest.java'
[2025-06-19T22:49:28.012Z]
[2025-06-19T22:49:28.012Z] ACTION: build -- Passed. All files up to date
[2025-06-19T22:49:28.012Z] REASON: Named class compiled on demand
[2025-06-19T22:49:28.012Z] TIME: 0.001 seconds
[2025-06-19T22:49:28.012Z] messages:
[2025-06-19T22:49:28.012Z] command: build ClassFileInstaller
[2025-06-19T22:49:28.012Z] reason: Named class compiled on demand
[2025-06-19T22:49:28.012Z] started: Thu Jun 19 22:49:20 GMT 2025
[2025-06-19T22:49:28.012Z] finished: Thu Jun 19 22:49:20 GMT 2025
[2025-06-19T22:49:28.012Z] elapsed time (seconds): 0.001
[2025-06-19T22:49:28.012Z]
[2025-06-19T22:49:28.012Z] ACTION: driver -- Passed. Execution successful
[2025-06-19T22:49:28.012Z] REASON: User specified action: run driver ClassFileInstaller sun.hotspot.WhiteBox sun.hotspot.WhiteBox$WhiteBoxPermission
[2025-06-19T22:49:28.012Z] TIME: 0.859 seconds
[2025-06-19T22:49:28.012Z] messages:
[2025-06-19T22:49:28.012Z] command: driver ClassFileInstaller sun.hotspot.WhiteBox sun.hotspot.WhiteBox$WhiteBoxPermission
[2025-06-19T22:49:28.012Z] reason: User specified action: run driver ClassFileInstaller sun.hotspot.WhiteBox sun.hotspot.WhiteBox$WhiteBoxPermission
[2025-06-19T22:49:28.012Z] started: Thu Jun 19 22:49:20 GMT 2025
[2025-06-19T22:49:28.012Z] Mode: agentvm
[2025-06-19T22:49:28.012Z] Agent id: 21
[2025-06-19T22:49:28.012Z] finished: Thu Jun 19 22:49:20 GMT 2025
[2025-06-19T22:49:28.012Z] elapsed time (seconds): 0.859
[2025-06-19T22:49:28.012Z] configuration:
[2025-06-19T22:49:28.012Z] Boot Layer
[2025-06-19T22:49:28.013Z] class path: C:\jenkins\workspace\Test_openjdk11_hs_extended.openjdk_x86-32_windows_testList_1\jvmtest\openjdk\jtreg\lib\javatest.jar
[2025-06-19T22:49:28.013Z] C:\jenkins\workspace\Test_openjdk11_hs_extended.openjdk_x86-32_windows_testList_1\jvmtest\openjdk\jtreg\lib\jtreg.jar
[2025-06-19T22:49:28.013Z] C:\jenkins\workspace\Test_openjdk11_hs_extended.openjdk_x86-32_windows_testList_1\jvmtest\openjdk\jtreg\lib\junit-platform-console-standalone-1.9.2.jar
[2025-06-19T22:49:28.013Z] C:\jenkins\workspace\Test_openjdk11_hs_extended.openjdk_x86-32_windows_testList_1\jvmtest\openjdk\jtreg\lib\testng-7.3.0.jar
[2025-06-19T22:49:28.013Z] C:\jenkins\workspace\Test_openjdk11_hs_extended.openjdk_x86-32_windows_testList_1\jvmtest\openjdk\jtreg\lib\guice-5.1.0.jar
[2025-06-19T22:49:28.013Z] C:\jenkins\workspace\Test_openjdk11_hs_extended.openjdk_x86-32_windows_testList_1\jvmtest\openjdk\jtreg\lib\jcommander-1.82.jar
[2025-06-19T22:49:28.013Z] patch: java.base C:\jenkins\workspace\Test_openjdk11_hs_extended.openjdk_x86-32_windows_testList_1\aqa-tests\TKG\output_1750365128106\hotspot_runtime_0\work\patches\java.base
[2025-06-19T22:49:28.013Z]
[2025-06-19T22:49:28.013Z] Test Layer
[2025-06-19T22:49:28.013Z] class path: C:\jenkins\workspace\Test_openjdk11_hs_extended.openjdk_x86-32_windows_testList_1\aqa-tests\TKG\output_1750365128106\hotspot_runtime_0\work\classes\0\runtime\handshake\HandshakeWalkOneExitTest.d
[2025-06-19T22:49:28.013Z] C:\jenkins\workspace\Test_openjdk11_hs_extended.openjdk_x86-32_windows_testList_1\aqa-tests\openjdk\openjdk-jdk\test\hotspot\jtreg\runtime\handshake
[2025-06-19T22:49:28.013Z] C:\jenkins\workspace\Test_openjdk11_hs_extended.openjdk_x86-32_windows_testList_1\aqa-tests\TKG\output_1750365128106\hotspot_runtime_0\work\classes\0\testlibrary
[2025-06-19T22:49:28.013Z] C:\jenkins\workspace\Test_openjdk11_hs_extended.openjdk_x86-32_windows_testList_1\aqa-tests\openjdk\openjdk-jdk\test\hotspot\jtreg\testlibrary
[2025-06-19T22:49:28.013Z] C:\jenkins\workspace\Test_openjdk11_hs_extended.openjdk_x86-32_windows_testList_1\aqa-tests\TKG\output_1750365128106\hotspot_runtime_0\work\classes\0\test\lib
[2025-06-19T22:49:28.013Z] C:\jenkins\workspace\Test_openjdk11_hs_extended.openjdk_x86-32_windows_testList_1\aqa-tests\openjdk\openjdk-jdk\test\lib
[2025-06-19T22:49:28.013Z]
[2025-06-19T22:49:28.013Z] rerun:
[2025-06-19T22:49:28.013Z] cd 'C:\jenkins\workspace\Test_openjdk11_hs_extended.openjdk_x86-32_windows_testList_1\aqa-tests\TKG\output_1750365128106\hotspot_runtime_0\work\scratch\1' && \
[2025-06-19T22:49:28.013Z] PATH='C:\Program Files\Java\jdk-17.0.13+11\bin;C:\cygwin64\bin;C:\Windows\system32;C:\Windows;C:\Windows\System32\Wbem;C:\Windows\System32\WindowsPowerShell\v1.0;C:\Windows\System32\OpenSSH;C:\Program Files\dotnet;C:\Users\adoptopenjdk\AppData\Local\Microsoft\WindowsApps;C:\Strawberry\perl\bin;C:\Program Files\Git\cmd;C:\openjdk\jdk-8\bin;C:\apache-ant\apache-ant-1.10.15\bin;C:\Program Files (x86)\IncrediBuild;C:\Program Files (x86)\Windows Kits\10\Windows Performance Toolkit;C:\rust\bin;C:\Program Files\IcedTeaWEB\bin;C:\Users\jenkins\AppData\Local\Microsoft\WindowsApps' \
[2025-06-19T22:49:28.013Z] SystemDrive=C: \
[2025-06-19T22:49:28.013Z] SystemRoot='C:\Windows' \
[2025-06-19T22:49:28.013Z] TEMP='C:\Users\jenkins\AppData\Local\Temp\2' \
[2025-06-19T22:49:28.013Z] TMP='C:\Users\jenkins\AppData\Local\Temp\2' \
[2025-06-19T22:49:28.013Z] windir='C:\Windows' \
[2025-06-19T22:49:28.013Z] 'c:\jenkins\workspace\Test_openjdk11_hs_extended.openjdk_x86-32_windows_testList_1\jdkbinary\j2sdk-image\bin\java' \
[2025-06-19T22:49:28.013Z] -Dtest.vm.opts='-ea -esa -Xmx512m' \
[2025-06-19T22:49:28.013Z] -Dtest.tool.vm.opts='-J-ea -J-esa -J-Xmx512m' \
[2025-06-19T22:49:28.013Z] -Dtest.compiler.opts= \
[2025-06-19T22:49:28.013Z] -Dtest.java.opts= \
[2025-06-19T22:49:28.013Z] -Dtest.jdk='c:\jenkins\workspace\Test_openjdk11_hs_extended.openjdk_x86-32_windows_testList_1\jdkbinary\j2sdk-image' \
[2025-06-19T22:49:28.013Z] -Dcompile.jdk='c:\jenkins\workspace\Test_openjdk11_hs_extended.openjdk_x86-32_windows_testList_1\jdkbinary\j2sdk-image' \
[2025-06-19T22:49:28.013Z] -Dtest.timeout.factor=8.0 \
[2025-06-19T22:49:28.013Z] -Dtest.nativepath='c:\jenkins\workspace\Test_openjdk11_hs_extended.openjdk_x86-32_windows_testList_1\jdkbinary\openjdk-test-image\hotspot\jtreg\native' \
[2025-06-19T22:49:28.013Z] -Dtest.root='C:\jenkins\workspace\Test_openjdk11_hs_extended.openjdk_x86-32_windows_testList_1\aqa-tests\openjdk\openjdk-jdk\test\hotspot\jtreg' \
[2025-06-19T22:49:28.013Z] -Dtest.name=runtime/handshake/HandshakeWalkOneExitTest.java \
[2025-06-19T22:49:28.013Z] -Dtest.file='C:\jenkins\workspace\Test_openjdk11_hs_extended.openjdk_x86-32_windows_testList_1\aqa-tests\openjdk\openjdk-jdk\test\hotspot\jtreg\runtime\handshake\HandshakeWalkOneExitTest.java' \
[2025-06-19T22:49:28.013Z] -Dtest.src='C:\jenkins\workspace\Test_openjdk11_hs_extended.openjdk_x86-32_windows_testList_1\aqa-tests\openjdk\openjdk-jdk\test\hotspot\jtreg\runtime\handshake' \
[2025-06-19T22:49:28.013Z] -Dtest.src.path='C:\jenkins\workspace\Test_openjdk11_hs_extended.openjdk_x86-32_windows_testList_1\aqa-tests\openjdk\openjdk-jdk\test\hotspot\jtreg\runtime\handshake;C:\jenkins\workspace\Test_openjdk11_hs_extended.openjdk_x86-32_windows_testList_1\aqa-tests\openjdk\openjdk-jdk\test\hotspot\jtreg\testlibrary;C:\jenkins\workspace\Test_openjdk11_hs_extended.openjdk_x86-32_windows_testList_1\aqa-tests\openjdk\openjdk-jdk\test\lib' \
[2025-06-19T22:49:28.013Z] -Dtest.classes='C:\jenkins\workspace\Test_openjdk11_hs_extended.openjdk_x86-32_windows_testList_1\aqa-tests\TKG\output_1750365128106\hotspot_runtime_0\work\classes\0\runtime\handshake\HandshakeWalkOneExitTest.d' \
[2025-06-19T22:49:28.013Z] -Dtest.class.path='C:\jenkins\workspace\Test_openjdk11_hs_extended.openjdk_x86-32_windows_testList_1\aqa-tests\TKG\output_1750365128106\hotspot_runtime_0\work\classes\0\runtime\handshake\HandshakeWalkOneExitTest.d;C:\jenkins\workspace\Test_openjdk11_hs_extended.openjdk_x86-32_windows_testList_1\aqa-tests\TKG\output_1750365128106\hotspot_runtime_0\work\classes\0\testlibrary;C:\jenkins\workspace\Test_openjdk11_hs_extended.openjdk_x86-32_windows_testList_1\aqa-tests\TKG\output_1750365128106\hotspot_runtime_0\work\classes\0\test\lib' \
[2025-06-19T22:49:28.013Z] -Dtest.class.path.prefix='C:\jenkins\workspace\Test_openjdk11_hs_extended.openjdk_x86-32_windows_testList_1\aqa-tests\TKG\output_1750365128106\hotspot_runtime_0\work\classes\0\runtime\handshake\HandshakeWalkOneExitTest.d;C:\jenkins\workspace\Test_openjdk11_hs_extended.openjdk_x86-32_windows_testList_1\aqa-tests\openjdk\openjdk-jdk\test\hotspot\jtreg\runtime\handshake;C:\jenkins\workspace\Test_openjdk11_hs_extended.openjdk_x86-32_windows_testList_1\aqa-tests\TKG\output_1750365128106\hotspot_runtime_0\work\classes\0\testlibrary;C:\jenkins\workspace\Test_openjdk11_hs_extended.openjdk_x86-32_windows_testList_1\aqa-tests\TKG\output_1750365128106\hotspot_runtime_0\work\classes\0\test\lib' \
[2025-06-19T22:49:28.013Z] -classpath 'C:\jenkins\workspace\Test_openjdk11_hs_extended.openjdk_x86-32_windows_testList_1\aqa-tests\TKG\output_1750365128106\hotspot_runtime_0\work\classes\0\runtime\handshake\HandshakeWalkOneExitTest.d;C:\jenkins\workspace\Test_openjdk11_hs_extended.openjdk_x86-32_windows_testList_1\aqa-tests\openjdk\openjdk-jdk\test\hotspot\jtreg\runtime\handshake;C:\jenkins\workspace\Test_openjdk11_hs_extended.openjdk_x86-32_windows_testList_1\aqa-tests\TKG\output_1750365128106\hotspot_runtime_0\work\classes\0\testlibrary;C:\jenkins\workspace\Test_openjdk11_hs_extended.openjdk_x86-32_windows_testList_1\aqa-tests\openjdk\openjdk-jdk\test\hotspot\jtreg\testlibrary;C:\jenkins\workspace\Test_openjdk11_hs_extended.openjdk_x86-32_windows_testList_1\aqa-tests\TKG\output_1750365128106\hotspot_runtime_0\work\classes\0\test\lib;C:\jenkins\workspace\Test_openjdk11_hs_extended.openjdk_x86-32_windows_testList_1\aqa-tests\openjdk\openjdk-jdk\test\lib;C:\jenkins\workspace\Test_openjdk11_hs_extended.openjdk_x86-32_windows_testList_1\jvmtest\openjdk\jtreg\lib\javatest.jar;C:\jenkins\workspace\Test_openjdk11_hs_extended.openjdk_x86-32_windows_testList_1\jvmtest\openjdk\jtreg\lib\jtreg.jar' \
[2025-06-19T22:49:28.013Z] ClassFileInstaller sun.hotspot.WhiteBox 'sun.hotspot.WhiteBox$WhiteBoxPermission'
[2025-06-19T22:49:28.013Z] STDERR:
[2025-06-19T22:49:28.013Z]
[2025-06-19T22:49:28.013Z] JavaTest Message: Test complete.
[2025-06-19T22:49:28.013Z]
[2025-06-19T22:49:28.013Z]
[2025-06-19T22:49:28.013Z] ACTION: build -- Passed. All files up to date
[2025-06-19T22:49:28.013Z] REASON: Named class compiled on demand
[2025-06-19T22:49:28.013Z] TIME: 0.015 seconds
[2025-06-19T22:49:28.013Z] messages:
[2025-06-19T22:49:28.013Z] command: build HandshakeWalkOneExitTest
[2025-06-19T22:49:28.013Z] reason: Named class compiled on demand
[2025-06-19T22:49:28.013Z] started: Thu Jun 19 22:49:20 GMT 2025
[2025-06-19T22:49:28.013Z] finished: Thu Jun 19 22:49:20 GMT 2025
[2025-06-19T22:49:28.013Z] elapsed time (seconds): 0.015
[2025-06-19T22:49:28.013Z]
[2025-06-19T22:49:28.013Z] ACTION: main -- Failed. Execution failed: `main' threw exception: java.lang.OutOfMemoryError: unable to create native thread: possibly out of memory or process/resource limits reached
[2025-06-19T22:49:28.013Z] REASON: User specified action: run main/othervm -Xbootclasspath/a:. -XX:+UnlockDiagnosticVMOptions -XX:+WhiteBoxAPI HandshakeWalkOneExitTest
[2025-06-19T22:49:28.013Z] TIME: 2.293 seconds
[2025-06-19T22:49:28.013Z] messages:
[2025-06-19T22:49:28.013Z] command: main -Xbootclasspath/a:. -XX:+UnlockDiagnosticVMOptions -XX:+WhiteBoxAPI HandshakeWalkOneExitTest
[2025-06-19T22:49:28.013Z] reason: User specified action: run main/othervm -Xbootclasspath/a:. -XX:+UnlockDiagnosticVMOptions -XX:+WhiteBoxAPI HandshakeWalkOneExitTest
[2025-06-19T22:49:28.013Z] started: Thu Jun 19 22:49:20 GMT 2025
[2025-06-19T22:49:28.013Z] Mode: othervm [/othervm specified]
[2025-06-19T22:49:28.013Z] finished: Thu Jun 19 22:49:23 GMT 2025
[2025-06-19T22:49:28.013Z] elapsed time (seconds): 2.293
[2025-06-19T22:49:28.013Z] configuration:
[2025-06-19T22:49:28.013Z] STDOUT:
[2025-06-19T22:49:28.013Z] [0.959s][warning][os,thread] Failed to start thread "Unknown thread" - _beginthreadex failed (ENOMEM) for attributes: stacksize: default, flags: CREATE_SUSPENDED STACK_SIZE_PARAM_IS.
[2025-06-19T22:49:28.013Z] [0.959s][warning][os,thread] Failed to start the native thread for java.lang.Thread "Thread-2380"
[2025-06-19T22:49:28.013Z] STDERR:
[2025-06-19T22:49:28.013Z] java.lang.OutOfMemoryError: unable to create native thread: possibly out of memory or process/resource limits reached
[2025-06-19T22:49:28.013Z] at java.base/java.lang.Thread.start0(Native Method)
[2025-06-19T22:49:28.013Z] at java.base/java.lang.Thread.start(Thread.java:798)
[2025-06-19T22:49:28.013Z] at HandshakeWalkOneExitTest.main(HandshakeWalkOneExitTest.java:69)
[2025-06-19T22:49:28.013Z] at java.base/jdk.internal.reflect.NativeMethodAccessorImpl.invoke0(Native Method)
[2025-06-19T22:49:28.013Z] at java.base/jdk.internal.reflect.NativeMethodAccessorImpl.invoke(NativeMethodAccessorImpl.java:62)
[2025-06-19T22:49:28.013Z] at java.base/jdk.internal.reflect.DelegatingMethodAccessorImpl.invoke(DelegatingMethodAccessorImpl.java:43)
[2025-06-19T22:49:28.013Z] at java.base/java.lang.reflect.Method.invoke(Method.java:566)
[2025-06-19T22:49:28.013Z] at com.sun.javatest.regtest.agent.MainWrapper$MainTask.run(MainWrapper.java:138)
[2025-06-19T22:49:28.013Z] at java.base/java.lang.Thread.run(Thread.java:829)
[2025-06-19T22:49:28.013Z]
[2025-06-19T22:49:28.013Z] JavaTest Message: Test threw exception: java.lang.OutOfMemoryError: unable to create native thread: possibly out of memory or process/resource limits reached
[2025-06-19T22:49:28.013Z] JavaTest Message: shutting down test
[2025-06-19T22:49:28.013Z]
[2025-06-19T22:49:28.013Z] STATUS:Failed.`main' threw exception: java.lang.OutOfMemoryError: unable to create native thread: possibly out of memory or process/resource limits reached
[2025-06-19T22:49:28.013Z] rerun:
[2025-06-19T22:49:28.013Z] cd 'C:\jenkins\workspace\Test_openjdk11_hs_extended.openjdk_x86-32_windows_testList_1\aqa-tests\TKG\output_1750365128106\hotspot_runtime_0\work\scratch\1' && \
[2025-06-19T22:49:28.013Z] PATH='C:\Program Files\Java\jdk-17.0.13+11\bin;C:\cygwin64\bin;C:\Windows\system32;C:\Windows;C:\Windows\System32\Wbem;C:\Windows\System32\WindowsPowerShell\v1.0;C:\Windows\System32\OpenSSH;C:\Program Files\dotnet;C:\Users\adoptopenjdk\AppData\Local\Microsoft\WindowsApps;C:\Strawberry\perl\bin;C:\Program Files\Git\cmd;C:\openjdk\jdk-8\bin;C:\apache-ant\apache-ant-1.10.15\bin;C:\Program Files (x86)\IncrediBuild;C:\Program Files (x86)\Windows Kits\10\Windows Performance Toolkit;C:\rust\bin;C:\Program Files\IcedTeaWEB\bin;C:\Users\jenkins\AppData\Local\Microsoft\WindowsApps' \
[2025-06-19T22:49:28.013Z] SystemDrive=C: \
[2025-06-19T22:49:28.013Z] SystemRoot='C:\Windows' \
[2025-06-19T22:49:28.013Z] TEMP='C:\Users\jenkins\AppData\Local\Temp\2' \
[2025-06-19T22:49:28.013Z] TMP='C:\Users\jenkins\AppData\Local\Temp\2' \
[2025-06-19T22:49:28.013Z] windir='C:\Windows' \
[2025-06-19T22:49:28.014Z] CLASSPATH='C:\jenkins\workspace\Test_openjdk11_hs_extended.openjdk_x86-32_windows_testList_1\aqa-tests\TKG\output_1750365128106\hotspot_runtime_0\work\classes\0\runtime\handshake\HandshakeWalkOneExitTest.d;C:\jenkins\workspace\Test_openjdk11_hs_extended.openjdk_x86-32_windows_testList_1\aqa-tests\openjdk\openjdk-jdk\test\hotspot\jtreg\runtime\handshake;C:\jenkins\workspace\Test_openjdk11_hs_extended.openjdk_x86-32_windows_testList_1\aqa-tests\TKG\output_1750365128106\hotspot_runtime_0\work\classes\0\testlibrary;C:\jenkins\workspace\Test_openjdk11_hs_extended.openjdk_x86-32_windows_testList_1\aqa-tests\openjdk\openjdk-jdk\test\hotspot\jtreg\testlibrary;C:\jenkins\workspace\Test_openjdk11_hs_extended.openjdk_x86-32_windows_testList_1\aqa-tests\TKG\output_1750365128106\hotspot_runtime_0\work\classes\0\test\lib;C:\jenkins\workspace\Test_openjdk11_hs_extended.openjdk_x86-32_windows_testList_1\aqa-tests\openjdk\openjdk-jdk\test\lib;C:\jenkins\workspace\Test_openjdk11_hs_extended.openjdk_x86-32_windows_testList_1\jvmtest\openjdk\jtreg\lib\javatest.jar;C:\jenkins\workspace\Test_openjdk11_hs_extended.openjdk_x86-32_windows_testList_1\jvmtest\openjdk\jtreg\lib\jtreg.jar' \
[2025-06-19T22:49:28.014Z] 'c:\jenkins\workspace\Test_openjdk11_hs_extended.openjdk_x86-32_windows_testList_1\jdkbinary\j2sdk-image\bin\java' \
[2025-06-19T22:49:28.014Z] -Dtest.vm.opts='-ea -esa -Xmx512m' \
[2025-06-19T22:49:28.014Z] -Dtest.tool.vm.opts='-J-ea -J-esa -J-Xmx512m' \
[2025-06-19T22:49:28.014Z] -Dtest.compiler.opts= \
[2025-06-19T22:49:28.014Z] -Dtest.java.opts= \
[2025-06-19T22:49:28.014Z] -Dtest.jdk='c:\jenkins\workspace\Test_openjdk11_hs_extended.openjdk_x86-32_windows_testList_1\jdkbinary\j2sdk-image' \
[2025-06-19T22:49:28.014Z] -Dcompile.jdk='c:\jenkins\workspace\Test_openjdk11_hs_extended.openjdk_x86-32_windows_testList_1\jdkbinary\j2sdk-image' \
[2025-06-19T22:49:28.014Z] -Dtest.timeout.factor=8.0 \
[2025-06-19T22:49:28.014Z] -Dtest.nativepath='c:\jenkins\workspace\Test_openjdk11_hs_extended.openjdk_x86-32_windows_testList_1\jdkbinary\openjdk-test-image\hotspot\jtreg\native' \
[2025-06-19T22:49:28.014Z] -Dtest.root='C:\jenkins\workspace\Test_openjdk11_hs_extended.openjdk_x86-32_windows_testList_1\aqa-tests\openjdk\openjdk-jdk\test\hotspot\jtreg' \
[2025-06-19T22:49:28.014Z] -Dtest.name=runtime/handshake/HandshakeWalkOneExitTest.java \
[2025-06-19T22:49:28.014Z] -Dtest.file='C:\jenkins\workspace\Test_openjdk11_hs_extended.openjdk_x86-32_windows_testList_1\aqa-tests\openjdk\openjdk-jdk\test\hotspot\jtreg\runtime\handshake\HandshakeWalkOneExitTest.java' \
[2025-06-19T22:49:28.014Z] -Dtest.src='C:\jenkins\workspace\Test_openjdk11_hs_extended.openjdk_x86-32_windows_testList_1\aqa-tests\openjdk\openjdk-jdk\test\hotspot\jtreg\runtime\handshake' \
[2025-06-19T22:49:28.014Z] -Dtest.src.path='C:\jenkins\workspace\Test_openjdk11_hs_extended.openjdk_x86-32_windows_testList_1\aqa-tests\openjdk\openjdk-jdk\test\hotspot\jtreg\runtime\handshake;C:\jenkins\workspace\Test_openjdk11_hs_extended.openjdk_x86-32_windows_testList_1\aqa-tests\openjdk\openjdk-jdk\test\hotspot\jtreg\testlibrary;C:\jenkins\workspace\Test_openjdk11_hs_extended.openjdk_x86-32_windows_testList_1\aqa-tests\openjdk\openjdk-jdk\test\lib' \
[2025-06-19T22:49:28.014Z] -Dtest.classes='C:\jenkins\workspace\Test_openjdk11_hs_extended.openjdk_x86-32_windows_testList_1\aqa-tests\TKG\output_1750365128106\hotspot_runtime_0\work\classes\0\runtime\handshake\HandshakeWalkOneExitTest.d' \
[2025-06-19T22:49:28.014Z] -Dtest.class.path='C:\jenkins\workspace\Test_openjdk11_hs_extended.openjdk_x86-32_windows_testList_1\aqa-tests\TKG\output_1750365128106\hotspot_runtime_0\work\classes\0\runtime\handshake\HandshakeWalkOneExitTest.d;C:\jenkins\workspace\Test_openjdk11_hs_extended.openjdk_x86-32_windows_testList_1\aqa-tests\TKG\output_1750365128106\hotspot_runtime_0\work\classes\0\testlibrary;C:\jenkins\workspace\Test_openjdk11_hs_extended.openjdk_x86-32_windows_testList_1\aqa-tests\TKG\output_1750365128106\hotspot_runtime_0\work\classes\0\test\lib' \
[2025-06-19T22:49:28.014Z] -Dtest.class.path.prefix='C:\jenkins\workspace\Test_openjdk11_hs_extended.openjdk_x86-32_windows_testList_1\aqa-tests\TKG\output_1750365128106\hotspot_runtime_0\work\classes\0\runtime\handshake\HandshakeWalkOneExitTest.d;C:\jenkins\workspace\Test_openjdk11_hs_extended.openjdk_x86-32_windows_testList_1\aqa-tests\openjdk\openjdk-jdk\test\hotspot\jtreg\runtime\handshake;C:\jenkins\workspace\Test_openjdk11_hs_extended.openjdk_x86-32_windows_testList_1\aqa-tests\TKG\output_1750365128106\hotspot_runtime_0\work\classes\0\testlibrary;C:\jenkins\workspace\Test_openjdk11_hs_extended.openjdk_x86-32_windows_testList_1\aqa-tests\TKG\output_1750365128106\hotspot_runtime_0\work\classes\0\test\lib' \
[2025-06-19T22:49:28.014Z] -ea \
[2025-06-19T22:49:28.014Z] -esa \
[2025-06-19T22:49:28.014Z] -Xmx512m \
[2025-06-19T22:49:28.014Z] '-Djava.library.path=c:\jenkins\workspace\Test_openjdk11_hs_extended.openjdk_x86-32_windows_testList_1\jdkbinary\openjdk-test-image\hotspot\jtreg\native' \
[2025-06-19T22:49:28.014Z] -Xbootclasspath/a:. \
[2025-06-19T22:49:28.014Z] -XX:+UnlockDiagnosticVMOptions \
[2025-06-19T22:49:28.014Z] -XX:+WhiteBoxAPI \
[2025-06-19T22:49:28.014Z] com.sun.javatest.regtest.agent.MainWrapper 'C:\jenkins\workspace\Test_openjdk11_hs_extended.openjdk_x86-32_windows_testList_1\aqa-tests\TKG\output_1750365128106\hotspot_runtime_0\work\runtime\handshake\HandshakeWalkOneExitTest.d\main.0.jta'
[2025-06-19T22:49:28.014Z]
[2025-06-19T22:49:28.014Z] TEST RESULT: Failed. Execution failed: `main' threw exception: java.lang.OutOfMemoryError: unable to create native thread: possibly out of memory or process/resource limits reached
[2025-06-19T22:49:28.014Z] --------------------------------------------------
[2025-06-19T22:58:10.585Z] Test results: passed: 509; failed: 3
[2025-06-19T22:58:11.313Z] Report written to C:\jenkins\workspace\Test_openjdk11_hs_extended.openjdk_x86-32_windows_testList_1\aqa-tests\TKG\output_1750365128106\hotspot_runtime_0\report\html\report.html
[2025-06-19T22:58:11.313Z] Results written to C:\jenkins\workspace\Test_openjdk11_hs_extended.openjdk_x86-32_windows_testList_1\aqa-tests\TKG\output_1750365128106\hotspot_runtime_0\work
[2025-06-19T22:58:11.313Z] Error: Some tests failed or other problems occurred.
[2025-06-19T22:58:11.681Z] -----------------------------------
[2025-06-19T22:58:11.681Z] hotspot_runtime_0_FAILED
[2025-06-19T22:58:11.681Z] -----------------------------------
[2025-06-19T22:58:11.681Z]
[2025-06-19T22:58:11.681Z] TEST TEARDOWN:
[2025-06-19T22:58:11.681Z] Nothing to be done for teardown.
[2025-06-19T22:58:11.681Z] hotspot_runtime_0 Finish Time: Thu Jun 19 22:58:11 2025 Epoch Time (ms): 1750373891448