Post Test
[2025-01-11T06:13:34.707Z] gmake[4]: Leaving directory '/home/jenkins/workspace/Test_openjdk17_hs_extended.openjdk_ppc64_aix_testList_4/aqa-tests/openjdk'
[2025-01-11T06:13:34.707Z] gmake[3]: Leaving directory '/home/jenkins/workspace/Test_openjdk17_hs_extended.openjdk_ppc64_aix_testList_4/aqa-tests'
[2025-01-11T06:13:34.707Z]
[2025-01-11T06:13:34.707Z]
[2025-01-11T06:13:34.707Z] All tests finished, run result summary:
[2025-01-11T06:13:34.707Z] cd "/home/jenkins/workspace/Test_openjdk17_hs_extended.openjdk_ppc64_aix_testList_4/aqa-tests/TKG/../TKG/scripts"; \
[2025-01-11T06:13:34.707Z] perl "resultsSum.pl" --failuremk="/home/jenkins/workspace/Test_openjdk17_hs_extended.openjdk_ppc64_aix_testList_4/aqa-tests/TKG/../TKG/failedtargets.mk" --resultFile="/home/jenkins/workspace/Test_openjdk17_hs_extended.openjdk_ppc64_aix_testList_4/aqa-tests/TKG/../TKG/output_1736568009485/TestTargetResult" --platFile="/home/jenkins/workspace/Test_openjdk17_hs_extended.openjdk_ppc64_aix_testList_4/aqa-tests/TKG/../TKG/resources/buildPlatformMap.properties" --diagnostic=failure --jdkVersion=17 --jdkImpl=hotspot --jdkVendor="eclipse" --spec=aix_ppc-64 --buildList=openjdk --customTarget="" --testTarget=testList --tapPath=/home/jenkins/workspace/Test_openjdk17_hs_extended.openjdk_ppc64_aix_testList_4/aqa-tests/TKG/../TKG/output_1736568009485/ --tapName=Test_openjdk17_hs_extended.openjdk_ppc64_aix_testList_4.tap --comment=""
[2025-01-11T06:13:34.707Z]
[2025-01-11T06:13:34.707Z]
[2025-01-11T06:13:34.707Z] TEST TARGETS SUMMARY
[2025-01-11T06:13:34.707Z] ++++++++++++++++++++++++++++++++++++++++++++++++++++++++++++++++++++++++++
[2025-01-11T06:13:34.707Z] PASSED test targets:
[2025-01-11T06:13:34.707Z] jdk_other_0 - Test results: passed: 272
[2025-01-11T06:13:34.707Z] jdk_nio_0 - Test results: passed: 433
[2025-01-11T06:13:34.707Z] jdk_time_1 - Test results: passed: 186
[2025-01-11T06:13:34.707Z] jdk_management_1 - Test results: passed: 126
[2025-01-11T06:13:34.707Z]
[2025-01-11T06:13:34.707Z] FAILED test targets:
[2025-01-11T06:13:34.707Z] jdk_security3_0 - Test results: passed: 863; failed: 1
[2025-01-11T06:13:34.707Z] Failed test cases:
[2025-01-11T06:13:34.707Z] TEST: sun/security/ssl/X509TrustManagerImpl/distrust/Symantec.java
[2025-01-11T06:13:34.707Z]
[2025-01-11T06:13:34.707Z] jdk_jmx_0 - Test results: passed: 248; failed: 1
[2025-01-11T06:13:34.707Z] Failed test cases:
[2025-01-11T06:13:34.707Z] TEST: javax/management/mxbean/ThreadStartTest.java
[2025-01-11T06:13:34.707Z]
[2025-01-11T06:13:34.707Z]
[2025-01-11T06:13:34.707Z] TOTAL: 6 EXECUTED: 6 PASSED: 4 FAILED: 2 DISABLED: 0 SKIPPED: 0
[2025-01-11T06:13:34.707Z] ++++++++++++++++++++++++++++++++++++++++++++++++++++++++++++++++++++++++++
[2025-01-11T06:13:34.707Z]
[2025-01-11T06:13:34.707Z] TESTCASES RESULTS SUMMARY: passed: 2,128; failed: 2; error: 0; skipped: 0
[2025-01-11T06:13:34.707Z] ++++++++++++++++++++++++++++++++++++++++++++++++++++++++++++++++++++++++++
[2025-01-11T06:13:34.707Z] gmake[2]: *** [settings.mk:450: resultsSummary] Error 2
[2025-01-11T06:13:34.707Z] gmake[2]: Leaving directory '/home/jenkins/workspace/Test_openjdk17_hs_extended.openjdk_ppc64_aix_testList_4/aqa-tests/TKG'
[2025-01-11T06:13:34.707Z] gmake[1]: *** [makefile:70: _testList] Error 2
[2025-01-11T06:13:34.707Z] gmake[1]: Leaving directory '/home/jenkins/workspace/Test_openjdk17_hs_extended.openjdk_ppc64_aix_testList_4/aqa-tests/TKG'
[2025-01-11T06:13:34.707Z] gmake: *** [parallelList.mk:20: testList_4] Error 2
[Pipeline] sh
[2025-01-11T06:13:37.024Z] + uname
[2025-01-11T06:13:37.024Z] + [ AIX = AIX ]
[2025-01-11T06:13:37.024Z] + MAKE=gmake
[2025-01-11T06:13:37.024Z] + gmake -f ./aqa-tests/TKG/testEnv.mk testEnvTeardown
[2025-01-11T06:13:37.024Z] gmake: Nothing to be done for 'testEnvTeardown'.
[Pipeline] echo
[2025-01-11T06:13:37.409Z] There were test failures, set build result to UNSTABLE.
[Pipeline] }
[Pipeline] // stage
[Pipeline] stage
[Pipeline] { (Post)
[Pipeline] step
[2025-01-11T06:13:37.691Z] TAP Reports Processing: START
[2025-01-11T06:13:37.693Z] Looking for TAP results report in workspace using pattern: aqa-tests/TKG/**/*.tap
[2025-01-11T06:13:39.653Z] Saving reports...
[2025-01-11T06:13:40.176Z] Processing '/home/jenkins/.jenkins/jobs/Test_openjdk17_hs_extended.openjdk_ppc64_aix_testList_4/builds/21/tap-master-files/aqa-tests/TKG/output_1736568009485/Test_openjdk17_hs_extended.openjdk_ppc64_aix_testList_4.tap'
[2025-01-11T06:13:40.176Z] Parsing TAP test result [/home/jenkins/.jenkins/jobs/Test_openjdk17_hs_extended.openjdk_ppc64_aix_testList_4/builds/21/tap-master-files/aqa-tests/TKG/output_1736568009485/Test_openjdk17_hs_extended.openjdk_ppc64_aix_testList_4.tap].
[2025-01-11T06:13:40.177Z] There are failed test cases. Marking build as UNSTABLE
[2025-01-11T06:13:40.177Z] TAP Reports Processing: FINISH
[Pipeline] echo
[2025-01-11T06:13:40.188Z] Saving aqa-tests/testenv/testenv.properties file on jenkins.
[Pipeline] archiveArtifacts
[2025-01-11T06:13:40.558Z] Archiving artifacts
[2025-01-11T06:13:41.598Z] Recording fingerprints
[Pipeline] echo
[2025-01-11T06:13:42.140Z] Saving aqa-tests/TKG/**/*.tap file on jenkins.
[Pipeline] archiveArtifacts
[2025-01-11T06:13:42.448Z] Archiving artifacts
[2025-01-11T06:13:44.453Z] Recording fingerprints
[Pipeline] sh
[2025-01-11T06:13:48.657Z] + tar -cf - ./aqa-tests/TKG/output_1736568009485
[2025-01-11T06:13:48.657Z] + 1> openjdk_test_output.tar.gz
[2025-01-11T06:13:48.657Z] + pigz -9
[2025-01-11T06:13:48.657Z] + 2> /dev/null
[2025-01-11T06:13:48.657Z] + gzip -9
[Pipeline] echo
[2025-01-11T06:13:58.873Z] ARTIFACTORY_SERVER is not set. Saving artifacts on jenkins.
[Pipeline] archiveArtifacts
[2025-01-11T06:13:59.058Z] Archiving artifacts
[2025-01-11T06:14:19.972Z] Recording fingerprints
[Pipeline] findFiles
[Pipeline] echo
[2025-01-11T06:14:27.015Z] Tap file found: aqa-tests/TKG/output_1736568009485/Test_openjdk17_hs_extended.openjdk_ppc64_aix_testList_4.tap...
[Pipeline] readFile
[Pipeline] echo
[2025-01-11T06:14:27.261Z] Rerun in Grinder with failed test targets: https://ci.adoptium.net/job/Grinder/parambuild/?SDK_RESOURCE=upstream&TARGET=testList+TESTLIST=jdk_security3_0,jdk_jmx_0&BASE_DOCKER_REGISTRY_CREDENTIAL_ID=&TEST_FLAG=&UPSTREAM_TEST_JOB_NAME=Test_openjdk17_hs_extended.openjdk_ppc64_aix&DOCKER_REQUIRED=false&ACTIVE_NODE_TIMEOUT=5&VENDOR_TEST_DIRS=&EXTRA_DOCKER_ARGS=&TKG_OWNER_BRANCH=adoptium%3Amaster&OPENJ9_SYSTEMTEST_OWNER_BRANCH=eclipse%3Amaster&PLATFORM=ppc64_aix&GENERATE_JOBS=false&KEEP_REPORTDIR=true&PERSONAL_BUILD=false&DOCKER_REGISTRY_DIR=&RERUN_ITERATIONS=1&ADOPTOPENJDK_REPO=https%3A%2F%2Fgithub.com%2Fadoptium%2Faqa-tests.git&SETUP_JCK_RUN=false&DOCKER_REGISTRY_URL_CREDENTIAL_ID=&LABEL=&EXTRA_OPTIONS=&CUSTOMIZED_SDK_URL=&BUILD_IDENTIFIER=&JENKINS_KEY=&ADOPTOPENJDK_BRANCH=v1.0.5-release&LIGHT_WEIGHT_CHECKOUT=false&USE_JRE=false&ARTIFACTORY_SERVER=&KEEP_WORKSPACE=false&USER_CREDENTIALS_ID=&JDK_VERSION=17&DOCKER_REGISTRY_URL=&ITERATIONS=1&VENDOR_TEST_REPOS=&JDK_REPO=https%3A%2F%2Fgithub.com%2Fadoptium%2Fjdk17u&JCK_GIT_BRANCH=master&OPENJ9_BRANCH=master&OPENJ9_SHA=&JCK_GIT_REPO=&VENDOR_TEST_BRANCHES=&UPSTREAM_JOB_NAME=build-scripts%2Fjobs%2Frelease%2Fjobs%2Fjdk17u%2Fjdk17u-release-aix-ppc64-temurin&OPENJ9_REPO=https%3A%2F%2Fgithub.com%2Feclipse-openj9%2Fopenj9.git&CLOUD_PROVIDER=&CUSTOM_TARGET=&VENDOR_TEST_SHAS=&JDK_BRANCH=jdk-17.0.14%2B6_adopt&LABEL_ADDITION=sw.os.aix.7_2&ARTIFACTORY_REPO=&ARTIFACTORY_ROOT_DIR=&UPSTREAM_TEST_JOB_NUMBER=169&DOCKERIMAGE_TAG=&TEST_TIME=&JDK_IMPL=hotspot&SSH_AGENT_CREDENTIAL=&AUTO_DETECT=true&SLACK_CHANNEL=aqavit-bot&DYNAMIC_COMPILE=false&RELATED_NODES=&ADOPTOPENJDK_SYSTEMTEST_OWNER_BRANCH=adoptium%3Amaster&APPLICATION_OPTIONS=&CUSTOMIZED_SDK_URL_CREDENTIAL_ID=eclipse_temurin_bot_email_and_token&ARCHIVE_TEST_RESULTS=false&NUM_MACHINES=&OPENJDK_SHA=&TRSS_URL=&RERUN_FAILURE=true&USE_TESTENV_PROPERTIES=true&BUILD_LIST=openjdk&ADDITIONAL_ARTIFACTS_REQUIRED=&UPSTREAM_JOB_NUMBER=36&STF_OWNER_BRANCH=adoptium%3Amaster&TIME_LIMIT=25&JVM_OPTIONS=&PARALLEL=None
[Pipeline] echo
[2025-01-11T06:14:27.319Z] Rerun failed jdk test cases in Grinder with jdk_custom target: https://ci.adoptium.net/job/Grinder/parambuild/?SDK_RESOURCE=upstream&TARGET=jdk_custom&BASE_DOCKER_REGISTRY_CREDENTIAL_ID=&TEST_FLAG=&UPSTREAM_TEST_JOB_NAME=Test_openjdk17_hs_extended.openjdk_ppc64_aix&DOCKER_REQUIRED=false&ACTIVE_NODE_TIMEOUT=5&VENDOR_TEST_DIRS=&EXTRA_DOCKER_ARGS=&TKG_OWNER_BRANCH=adoptium%3Amaster&OPENJ9_SYSTEMTEST_OWNER_BRANCH=eclipse%3Amaster&PLATFORM=ppc64_aix&GENERATE_JOBS=false&KEEP_REPORTDIR=true&PERSONAL_BUILD=false&DOCKER_REGISTRY_DIR=&RERUN_ITERATIONS=1&ADOPTOPENJDK_REPO=https%3A%2F%2Fgithub.com%2Fadoptium%2Faqa-tests.git&SETUP_JCK_RUN=false&DOCKER_REGISTRY_URL_CREDENTIAL_ID=&LABEL=&EXTRA_OPTIONS=&CUSTOMIZED_SDK_URL=&BUILD_IDENTIFIER=&JENKINS_KEY=&ADOPTOPENJDK_BRANCH=v1.0.5-release&LIGHT_WEIGHT_CHECKOUT=false&USE_JRE=false&ARTIFACTORY_SERVER=&KEEP_WORKSPACE=false&USER_CREDENTIALS_ID=&JDK_VERSION=17&DOCKER_REGISTRY_URL=&ITERATIONS=1&VENDOR_TEST_REPOS=&JDK_REPO=https%3A%2F%2Fgithub.com%2Fadoptium%2Fjdk17u&JCK_GIT_BRANCH=master&OPENJ9_BRANCH=master&OPENJ9_SHA=&JCK_GIT_REPO=&VENDOR_TEST_BRANCHES=&UPSTREAM_JOB_NAME=build-scripts%2Fjobs%2Frelease%2Fjobs%2Fjdk17u%2Fjdk17u-release-aix-ppc64-temurin&OPENJ9_REPO=https%3A%2F%2Fgithub.com%2Feclipse-openj9%2Fopenj9.git&CLOUD_PROVIDER=&CUSTOM_TARGET=sun%2Fsecurity%2Fssl%2FX509TrustManagerImpl%2Fdistrust%2FSymantec.java+javax%2Fmanagement%2Fmxbean%2FThreadStartTest.java&VENDOR_TEST_SHAS=&JDK_BRANCH=jdk-17.0.14%2B6_adopt&LABEL_ADDITION=sw.os.aix.7_2&ARTIFACTORY_REPO=&ARTIFACTORY_ROOT_DIR=&UPSTREAM_TEST_JOB_NUMBER=169&DOCKERIMAGE_TAG=&TEST_TIME=&JDK_IMPL=hotspot&SSH_AGENT_CREDENTIAL=&AUTO_DETECT=true&SLACK_CHANNEL=aqavit-bot&DYNAMIC_COMPILE=false&RELATED_NODES=&ADOPTOPENJDK_SYSTEMTEST_OWNER_BRANCH=adoptium%3Amaster&APPLICATION_OPTIONS=&CUSTOMIZED_SDK_URL_CREDENTIAL_ID=eclipse_temurin_bot_email_and_token&ARCHIVE_TEST_RESULTS=false&NUM_MACHINES=&OPENJDK_SHA=&TRSS_URL=&RERUN_FAILURE=true&USE_TESTENV_PROPERTIES=true&BUILD_LIST=openjdk&ADDITIONAL_ARTIFACTS_REQUIRED=&UPSTREAM_JOB_NUMBER=36&STF_OWNER_BRANCH=adoptium%3Amaster&TIME_LIMIT=25&JVM_OPTIONS=&PARALLEL=None
[Pipeline] junit
[2025-01-11T06:14:27.509Z] Recording test results
[2025-01-11T06:14:44.100Z] [Checks API] No suitable checks publisher found.
[Pipeline] }
[Pipeline] // stage
[Pipeline] echo
[2025-01-11T06:14:44.144Z] PROCESSCATCH: Terminating any hung/left over test processes:
[Pipeline] sh
[2025-01-11T06:14:46.153Z] + aqa-tests/terminateTestProcesses.sh jenkins
[2025-01-11T06:14:46.153Z] + 2>& 1
[2025-01-11T06:14:46.153Z] Unix type machine..
[2025-01-11T06:14:46.153Z] jenkins 20513172 1 0 03:59:59 - 0:00 /usr/bin/X11/X -force -vfb -x abx -x dbe -x GLX -secIP 000 :0
[2025-01-11T06:14:46.153Z] Boooo - there are rogue processes kicking about
[2025-01-11T06:14:46.153Z] Issuing a kill to all processes shown above
[2025-01-11T06:14:46.153Z] Sleeping for 10 seconds...
[2025-01-11T06:14:56.011Z] Processes stopped successfully
[Pipeline] cleanWs
[2025-01-11T06:14:56.719Z] [WS-CLEANUP] Deleting project workspace...
[2025-01-11T06:14:56.720Z] [WS-CLEANUP] Deferred wipeout is disabled by the job configuration...
[2025-01-11T06:15:16.830Z] [WS-CLEANUP] done
[Pipeline] sh
[2025-01-11T06:15:18.847Z] + find /tmp -name *core* -print -exec rm -f {} ;
[2025-01-11T06:15:18.847Z] + 2> /dev/null
[2025-01-11T06:15:18.847Z] + true
[Pipeline] }
[Pipeline] // timeout
[Pipeline] timeout
[2025-01-11T06:15:19.219Z] Timeout set to expire in 5 min 0 sec
[Pipeline] {
[Pipeline] }
[Pipeline] // timeout
[Pipeline] }
[Pipeline] // node
[Pipeline] }
[Pipeline] // stage
[Pipeline] echo
[2025-01-11T06:15:19.388Z] SETUP_LABEL: ci.role.test
[Pipeline] }
[Pipeline] // timestamps
[Pipeline] End of Pipeline
/home/jenkins/.jenkins/workspace/Test_openjdk17_hs_extended.openjdk_ppc64_aix_testList_4@tmp/jfrog/21/.jfrog deleted
Finished: UNSTABLE