PatModImg_Unex_0
[2024-10-31T07:37:42.729Z] Running test PatModImg_Unex_0 ...
[2024-10-31T07:37:42.729Z] ===============================================
[2024-10-31T07:37:43.071Z] PatModImg_Unex_0 Start Time: Thu Oct 31 07:37:42 2024 Epoch Time (ms): 1730360262790
[2024-10-31T07:37:43.071Z] variation: Mode150
[2024-10-31T07:37:43.454Z] JVM_OPTIONS: -XX:+UseCompressedOops
[2024-10-31T07:37:43.454Z] { \
[2024-10-31T07:37:43.454Z] echo ""; echo "TEST SETUP:"; \
[2024-10-31T07:37:43.454Z] echo "Nothing to be done for setup."; \
[2024-10-31T07:37:43.454Z] mkdir -p "C:/workspace/workspace/Test_openjdk17_hs_sanity.system_x86-64_windows_testList_1/aqa-tests/\\TKG\\output_17303582934896\\PatModImg_Unex_0"; \
[2024-10-31T07:37:43.454Z] cd "C:/workspace/workspace/Test_openjdk17_hs_sanity.system_x86-64_windows_testList_1/aqa-tests/\\TKG\\output_17303582934896\\PatModImg_Unex_0"; \
[2024-10-31T07:37:43.454Z] echo ""; echo "TESTING:"; \
[2024-10-31T07:37:43.454Z] perl C:/workspace/workspace/Test_openjdk17_hs_sanity.system_x86-64_windows_testList_1/aqa-tests///..//jvmtest\\system\\modularity/../\\STF\\stf.core\\scripts\\stf.pl -test-root="C:/workspace/workspace/Test_openjdk17_hs_sanity.system_x86-64_windows_testList_1/aqa-tests///..//jvmtest\\system\\modularity/../\\STF;C:/workspace/workspace/Test_openjdk17_hs_sanity.system_x86-64_windows_testList_1/aqa-tests///..//jvmtest\\system\\modularity/../\\aqa-systemtest""" -systemtest-prereqs="c:/workspace/workspace/Test_openjdk17_hs_sanity.system_x86-64_windows_testList_1/../../testDependency/system_lib\\" -java-args=' -XX:+UseCompressedOops ' -results-root="C:/workspace/workspace/Test_openjdk17_hs_sanity.system_x86-64_windows_testList_1/aqa-tests/\\TKG\\output_17303582934896\\PatModImg_Unex_0" -test=PatModImgTest -test-args="variant=Unex"; \
[2024-10-31T07:37:43.454Z] if [ $? -eq 0 ]; then echo "-----------------------------------"; echo "PatModImg_Unex_0""_PASSED"; echo "-----------------------------------"; cd C:/workspace/workspace/Test_openjdk17_hs_sanity.system_x86-64_windows_testList_1/aqa-tests/; rm -f -r "C:/workspace/workspace/Test_openjdk17_hs_sanity.system_x86-64_windows_testList_1/aqa-tests/\\TKG\\output_17303582934896\\PatModImg_Unex_0"; else echo "-----------------------------------"; echo "PatModImg_Unex_0""_FAILED"; echo "-----------------------------------"; fi; \
[2024-10-31T07:37:43.454Z] echo ""; echo "TEST TEARDOWN:"; \
[2024-10-31T07:37:43.454Z] echo "Nothing to be done for teardown."; \
[2024-10-31T07:37:43.454Z] } 2>&1 | tee -a "C:/workspace/workspace/Test_openjdk17_hs_sanity.system_x86-64_windows_testList_1/aqa-tests/\\TKG\\output_17303582934896\\TestTargetResult";
[2024-10-31T07:37:43.454Z]
[2024-10-31T07:37:43.454Z] TEST SETUP:
[2024-10-31T07:37:43.454Z] Nothing to be done for setup.
[2024-10-31T07:37:43.454Z]
[2024-10-31T07:37:43.454Z] TESTING:
[2024-10-31T07:37:43.788Z] STF 07:37:43.572 - ========================= S T F =========================
[2024-10-31T07:37:43.788Z] systemtest-prereqs has been processed, and set to: c:/workspace/testDependency/system_libRetrieving amount of free space on drive containing C:/workspace/workspace/Test_openjdk17_hs_sanity.system_x86-64_windows_testList_1/aqa-tests/\TKG\output_17303582934896\PatModImg_Unex_0
[2024-10-31T07:37:43.788Z] There is 96551 Mb free
[2024-10-31T07:37:43.788Z] STF 07:37:43.636 - ================== G E N E R A T I O N ==================
[2024-10-31T07:37:43.788Z] STF 07:37:43.639 - Checking JVM: c:/workspace/workspace/Test_openjdk17_hs_sanity.system_x86-64_windows_testList_1/jdkbinary/j2sdk-image
[2024-10-31T07:37:43.788Z] STF 07:37:43.639 - Starting process to generate scripts: c:/workspace/workspace/Test_openjdk17_hs_sanity.system_x86-64_windows_testList_1/jdkbinary/j2sdk-image/bin/java -Dlog4j.skipJansi=true -Djava.system.class.loader=net.adoptopenjdk.stf.runner.StfClassLoader -classpath c:/workspace/workspace/Test_openjdk17_hs_sanity.system_x86-64_windows_testList_1/../../testDependency/system_lib\/log4j/log4j-api.jar;c:/workspace/workspace/Test_openjdk17_hs_sanity.system_x86-64_windows_testList_1/../../testDependency/system_lib\/log4j/log4j-core.jar;C:/workspace/workspace/Test_openjdk17_hs_sanity.system_x86-64_windows_testList_1/jvmtest/system/STF/stf.core/scripts/../bin net.adoptopenjdk.stf.runner.StfRunner -properties "C:/workspace/workspace/Test_openjdk17_hs_sanity.system_x86-64_windows_testList_1/aqa-tests/\TKG\output_17303582934896\PatModImg_Unex_0/20241031-073743-PatModImgTest/stf_parameters.properties, , C:/workspace/workspace/Test_openjdk17_hs_sanity.system_x86-64_windows_testList_1/jvmtest/system/STF/stf.core/config/stf.properties" -testDir "C:/workspace/workspace/Test_openjdk17_hs_sanity.system_x86-64_windows_testList_1/aqa-tests/\TKG\output_17303582934896\PatModImg_Unex_0/20241031-073743-PatModImgTest"
[2024-10-31T07:37:43.788Z] GEN stderr OpenJDK 64-Bit Server VM warning: Archived non-system classes are disabled because the java.system.class.loader property is specified (value = "net.adoptopenjdk.stf.runner.StfClassLoader"). To use archived non-system classes, this property must not be set
[2024-10-31T07:37:44.904Z] GEN 07:37:44.777 - Found test. Project: 'openjdk.test.modularity' class: 'PatModImgTest.class' Dir: 'C:\workspace\workspace\Test_openjdk17_hs_sanity.system_x86-64_windows_testList_1\jvmtest\system\aqa-systemtest\openjdk.test.modularity\bin'
[2024-10-31T07:37:44.905Z] GEN 07:37:44.796 - Found test. Project: 'openjdk.test.modularity' class: 'net.adoptopenjdk.test.modularity.PatModImgTest'
[2024-10-31T07:37:45.232Z] GEN Classpath directories used by project 'openjdk.test.modularity':
[2024-10-31T07:37:45.232Z] GEN C:\workspace\workspace\Test_openjdk17_hs_sanity.system_x86-64_windows_testList_1\jvmtest\system\aqa-systemtest\openjdk.test.modularity\bin\common-mods\displayService
[2024-10-31T07:37:45.232Z] GEN C:\workspace\workspace\Test_openjdk17_hs_sanity.system_x86-64_windows_testList_1\jvmtest\system\aqa-systemtest\openjdk.test.modularity\bin\common-mods\com.helper
[2024-10-31T07:37:45.232Z] GEN C:\workspace\workspace\Test_openjdk17_hs_sanity.system_x86-64_windows_testList_1\jvmtest\system\aqa-systemtest\openjdk.test.modularity\bin\common-mods\displayServiceImpl1
[2024-10-31T07:37:45.232Z] GEN C:\workspace\workspace\Test_openjdk17_hs_sanity.system_x86-64_windows_testList_1\jvmtest\system\aqa-systemtest\openjdk.test.modularity\bin\common-mods\com.discreet
[2024-10-31T07:37:45.232Z] GEN C:\workspace\workspace\Test_openjdk17_hs_sanity.system_x86-64_windows_testList_1\jvmtest\system\aqa-systemtest\openjdk.test.modularity\bin\common-mods\com.hello
[2024-10-31T07:37:45.232Z] GEN C:\workspace\workspace\Test_openjdk17_hs_sanity.system_x86-64_windows_testList_1\jvmtest\system\aqa-systemtest\openjdk.test.modularity\bin\common-mods\com.hola
[2024-10-31T07:37:45.232Z] GEN C:\workspace\workspace\Test_openjdk17_hs_sanity.system_x86-64_windows_testList_1\jvmtest\system\aqa-systemtest\openjdk.test.modularity\bin\common-mods\displayServiceImpl2
[2024-10-31T07:37:45.232Z] GEN C:\workspace\workspace\Test_openjdk17_hs_sanity.system_x86-64_windows_testList_1\jvmtest\system\aqa-systemtest\openjdk.test.modularity\bin\common-mods\com.hi
[2024-10-31T07:37:45.232Z] GEN C:\workspace\workspace\Test_openjdk17_hs_sanity.system_x86-64_windows_testList_1\jvmtest\system\aqa-systemtest\openjdk.test.modularity\bin\common-override
[2024-10-31T07:37:45.232Z] GEN C:\workspace\workspace\Test_openjdk17_hs_sanity.system_x86-64_windows_testList_1\jvmtest\system\aqa-systemtest\openjdk.test.modularity\bin\common-override-new
[2024-10-31T07:37:45.232Z] GEN C:\workspace\workspace\Test_openjdk17_hs_sanity.system_x86-64_windows_testList_1\jvmtest\system\aqa-systemtest\openjdk.test.modularity\bin\common\displayServiceImpl3
[2024-10-31T07:37:45.232Z] GEN C:\workspace\workspace\Test_openjdk17_hs_sanity.system_x86-64_windows_testList_1\jvmtest\system\aqa-systemtest\openjdk.test.modularity\bin\common\displayServiceImpl4
[2024-10-31T07:37:45.232Z] GEN C:\workspace\workspace\Test_openjdk17_hs_sanity.system_x86-64_windows_testList_1\jvmtest\system\aqa-systemtest\openjdk.test.modularity\bin\common
[2024-10-31T07:37:45.232Z] GEN C:\workspace\workspace\Test_openjdk17_hs_sanity.system_x86-64_windows_testList_1\jvmtest\system\aqa-systemtest\openjdk.test.modularity\bin\tests
[2024-10-31T07:37:45.232Z] GEN C:\\workspace\\workspace\\Test_openjdk17_hs_sanity.system_x86-64_windows_testList_1\\jvmtest\\system\\aqa-systemtest\\openjdk.test.modularity\\bin
[2024-10-31T07:37:45.232Z] GEN C:\\workspace\\workspace\\Test_openjdk17_hs_sanity.system_x86-64_windows_testList_1\\jvmtest\\system\\STF\\stf.core\\bin
[2024-10-31T07:37:45.232Z] GEN c:/workspace/testDependency/system_lib/log4j/log4j-api.jar
[2024-10-31T07:37:45.232Z] GEN c:/workspace/testDependency/system_lib/log4j/log4j-core.jar
[2024-10-31T07:37:45.232Z] GEN c:/workspace/testDependency/system_lib/junit/junit.jar
[2024-10-31T07:37:45.232Z] GEN 07:37:45.086 - Using Mode NoOptions. Values = ''
[2024-10-31T07:37:45.561Z] GEN 07:37:45.216 -
[2024-10-31T07:37:45.561Z] GEN 07:37:45.216 - Test command summary:
[2024-10-31T07:37:45.561Z] GEN 07:37:45.217 - Step Stage Command Description
[2024-10-31T07:37:45.561Z] GEN 07:37:45.217 - -----+--------+-----------------+------------
[2024-10-31T07:37:45.561Z] GEN 07:37:45.217 - 1 execute jar Create com.hello jar
[2024-10-31T07:37:45.561Z] GEN 07:37:45.217 - 2 execute jar Create com.hola jar
[2024-10-31T07:37:45.561Z] GEN 07:37:45.217 - 3 execute jar Create com.helper jar
[2024-10-31T07:37:45.561Z] GEN 07:37:45.217 - 4 execute jar Create com.discreet jar
[2024-10-31T07:37:45.561Z] GEN 07:37:45.217 - 5 execute jar Create tests jar
[2024-10-31T07:37:45.561Z] GEN 07:37:45.217 - 6 execute jlink Create runtime image for PatchModule test
[2024-10-31T07:37:45.561Z] GEN 07:37:45.217 - 7 execute jar Create com.hello jar
[2024-10-31T07:37:45.561Z] GEN 07:37:45.218 - 8 execute jar create java.xml.jar
[2024-10-31T07:37:45.561Z] GEN 07:37:45.218 - 9 execute Run java (Negative test) Include a new package that is not exported and check if the public type cannot be accessed
[2024-10-31T07:37:45.561Z] GEN 07:37:45.218 - 10 execute count Check output
[2024-10-31T07:37:45.561Z] GEN 07:37:45.218 - 11 execute Run java Include a new package that is not exported and check if the public type can be accessed by adding --add-exports
[2024-10-31T07:37:45.561Z] STF 07:37:45.271 -
[2024-10-31T07:37:45.561Z] STF 07:37:45.272 - Script generation completed
[2024-10-31T07:37:45.561Z] STF 07:37:45.272 -
[2024-10-31T07:37:45.561Z] STF 07:37:45.274 -
[2024-10-31T07:37:45.561Z] STF 07:37:45.274 - ======================= S E T U P =======================
[2024-10-31T07:37:45.561Z] STF 07:37:45.274 - Running setup: perl C:/workspace/workspace/Test_openjdk17_hs_sanity.system_x86-64_windows_testList_1/aqa-tests/\TKG\output_17303582934896\PatModImg_Unex_0/20241031-073743-PatModImgTest/setUp.pl
[2024-10-31T07:37:45.561Z] STF 07:37:45.453 - SETUP stage completed
[2024-10-31T07:37:45.561Z] STF 07:37:45.469 -
[2024-10-31T07:37:45.561Z] STF 07:37:45.469 - ==================== E X E C U T E - ====================
[2024-10-31T07:37:45.561Z] STF 07:37:45.469 - Running execute: perl C:/workspace/workspace/Test_openjdk17_hs_sanity.system_x86-64_windows_testList_1/aqa-tests/\TKG\output_17303582934896\PatModImg_Unex_0/20241031-073743-PatModImgTest/execute.pl
[2024-10-31T07:37:45.892Z] STF 07:37:45.654 -
[2024-10-31T07:37:45.892Z] STF 07:37:45.654 - Java version
[2024-10-31T07:37:45.892Z] STF 07:37:45.654 - Running: c:/workspace/workspace/Test_openjdk17_hs_sanity.system_x86-64_windows_testList_1/jdkbinary/j2sdk-image/bin/java -version
[2024-10-31T07:37:45.892Z] openjdk version "17.0.14-beta" 2025-01-21
[2024-10-31T07:37:45.892Z] OpenJDK Runtime Environment Temurin-17.0.14+1-202410302036 (build 17.0.14-beta+1-ea)
[2024-10-31T07:37:45.892Z] OpenJDK 64-Bit Server VM Temurin-17.0.14+1-202410302036 (build 17.0.14-beta+1-ea, mixed mode, sharing)
[2024-10-31T07:37:45.892Z] STF 07:37:45.769 -
[2024-10-31T07:37:45.892Z] STF 07:37:45.769 - +------ Step 1 - Create com.hello jar
[2024-10-31T07:37:45.892Z] STF 07:37:45.769 - | Create modular jar
[2024-10-31T07:37:45.892Z] STF 07:37:45.769 - | ModuleSpec: openjdk.test.modularity/bin/common-mods/com.hello
[2024-10-31T07:37:45.892Z] STF 07:37:45.769 - | ModuleVersion: null
[2024-10-31T07:37:45.892Z] STF 07:37:45.769 - | MainClass: null
[2024-10-31T07:37:45.892Z] STF 07:37:45.769 - | HashModules: null
[2024-10-31T07:37:45.892Z] STF 07:37:45.769 - |
[2024-10-31T07:37:45.892Z] STF 07:37:45.770 - Running command: c:/workspace/workspace/Test_openjdk17_hs_sanity.system_x86-64_windows_testList_1/jdkbinary/j2sdk-image/bin/jar --create --file C:/workspace/workspace/Test_openjdk17_hs_sanity.system_x86-64_windows_testList_1/aqa-tests/TKG/output_17303582934896/PatModImg_Unex_0/20241031-073743-PatModImgTest/modules/1.com.hello.jar -C C:\workspace\workspace\Test_openjdk17_hs_sanity.system_x86-64_windows_testList_1\jvmtest\system\aqa-systemtest\openjdk.test.modularity\bin\common-mods\com.hello .
[2024-10-31T07:37:45.892Z] STF 07:37:45.771 - Redirecting stderr to C:/workspace/workspace/Test_openjdk17_hs_sanity.system_x86-64_windows_testList_1/aqa-tests/TKG/output_17303582934896/PatModImg_Unex_0/20241031-073743-PatModImgTest/results/1.CMJ.stderr
[2024-10-31T07:37:45.892Z] STF 07:37:45.771 - Redirecting stdout to C:/workspace/workspace/Test_openjdk17_hs_sanity.system_x86-64_windows_testList_1/aqa-tests/TKG/output_17303582934896/PatModImg_Unex_0/20241031-073743-PatModImgTest/results/1.CMJ.stdout
[2024-10-31T07:37:45.892Z] STF 07:37:45.813 - Monitoring processes: CMJ
[2024-10-31T07:37:46.218Z] STF 07:37:46.160 - Monitoring Report Summary:
[2024-10-31T07:37:46.218Z] STF 07:37:46.160 - o Process CMJ ended with the expected exit code (0)
[2024-10-31T07:37:46.218Z] STF 07:37:46.160 - Created modular jar: 1.com.hello.jar
[2024-10-31T07:37:46.218Z] STF 07:37:46.160 -
[2024-10-31T07:37:46.218Z] STF 07:37:46.160 - +------ Step 2 - Create com.hola jar
[2024-10-31T07:37:46.218Z] STF 07:37:46.160 - | Create modular jar
[2024-10-31T07:37:46.218Z] STF 07:37:46.160 - | ModuleSpec: openjdk.test.modularity/bin/common-mods/com.hola
[2024-10-31T07:37:46.218Z] STF 07:37:46.160 - | ModuleVersion: null
[2024-10-31T07:37:46.218Z] STF 07:37:46.160 - | MainClass: null
[2024-10-31T07:37:46.218Z] STF 07:37:46.160 - | HashModules: null
[2024-10-31T07:37:46.218Z] STF 07:37:46.160 - |
[2024-10-31T07:37:46.218Z] STF 07:37:46.161 - Running command: c:/workspace/workspace/Test_openjdk17_hs_sanity.system_x86-64_windows_testList_1/jdkbinary/j2sdk-image/bin/jar --create --file C:/workspace/workspace/Test_openjdk17_hs_sanity.system_x86-64_windows_testList_1/aqa-tests/TKG/output_17303582934896/PatModImg_Unex_0/20241031-073743-PatModImgTest/modules/2.com.hola.jar -C C:\workspace\workspace\Test_openjdk17_hs_sanity.system_x86-64_windows_testList_1\jvmtest\system\aqa-systemtest\openjdk.test.modularity\bin\common-mods\com.hola .
[2024-10-31T07:37:46.218Z] STF 07:37:46.161 - Redirecting stderr to C:/workspace/workspace/Test_openjdk17_hs_sanity.system_x86-64_windows_testList_1/aqa-tests/TKG/output_17303582934896/PatModImg_Unex_0/20241031-073743-PatModImgTest/results/2.CMJ.stderr
[2024-10-31T07:37:46.218Z] STF 07:37:46.161 - Redirecting stdout to C:/workspace/workspace/Test_openjdk17_hs_sanity.system_x86-64_windows_testList_1/aqa-tests/TKG/output_17303582934896/PatModImg_Unex_0/20241031-073743-PatModImgTest/results/2.CMJ.stdout
[2024-10-31T07:37:46.218Z] STF 07:37:46.169 - Monitoring processes: CMJ
[2024-10-31T07:37:46.908Z] STF 07:37:46.540 - Monitoring Report Summary:
[2024-10-31T07:37:46.908Z] STF 07:37:46.540 - o Process CMJ ended with the expected exit code (0)
[2024-10-31T07:37:46.908Z] STF 07:37:46.540 - Created modular jar: 2.com.hola.jar
[2024-10-31T07:37:46.908Z] STF 07:37:46.540 -
[2024-10-31T07:37:46.908Z] STF 07:37:46.540 - +------ Step 3 - Create com.helper jar
[2024-10-31T07:37:46.908Z] STF 07:37:46.540 - | Create modular jar
[2024-10-31T07:37:46.908Z] STF 07:37:46.540 - | ModuleSpec: openjdk.test.modularity/bin/common-mods/com.helper
[2024-10-31T07:37:46.908Z] STF 07:37:46.540 - | ModuleVersion: null
[2024-10-31T07:37:46.908Z] STF 07:37:46.540 - | MainClass: null
[2024-10-31T07:37:46.908Z] STF 07:37:46.540 - | HashModules: null
[2024-10-31T07:37:46.908Z] STF 07:37:46.540 - |
[2024-10-31T07:37:46.908Z] STF 07:37:46.540 - Running command: c:/workspace/workspace/Test_openjdk17_hs_sanity.system_x86-64_windows_testList_1/jdkbinary/j2sdk-image/bin/jar --create --file C:/workspace/workspace/Test_openjdk17_hs_sanity.system_x86-64_windows_testList_1/aqa-tests/TKG/output_17303582934896/PatModImg_Unex_0/20241031-073743-PatModImgTest/modules/3.com.helper.jar -C C:\workspace\workspace\Test_openjdk17_hs_sanity.system_x86-64_windows_testList_1\jvmtest\system\aqa-systemtest\openjdk.test.modularity\bin\common-mods\com.helper .
[2024-10-31T07:37:46.908Z] STF 07:37:46.541 - Redirecting stderr to C:/workspace/workspace/Test_openjdk17_hs_sanity.system_x86-64_windows_testList_1/aqa-tests/TKG/output_17303582934896/PatModImg_Unex_0/20241031-073743-PatModImgTest/results/3.CMJ.stderr
[2024-10-31T07:37:46.908Z] STF 07:37:46.541 - Redirecting stdout to C:/workspace/workspace/Test_openjdk17_hs_sanity.system_x86-64_windows_testList_1/aqa-tests/TKG/output_17303582934896/PatModImg_Unex_0/20241031-073743-PatModImgTest/results/3.CMJ.stdout
[2024-10-31T07:37:46.908Z] STF 07:37:46.548 - Monitoring processes: CMJ
[2024-10-31T07:37:47.235Z] STF 07:37:46.883 - Monitoring Report Summary:
[2024-10-31T07:37:47.235Z] STF 07:37:46.883 - o Process CMJ ended with the expected exit code (0)
[2024-10-31T07:37:47.235Z] STF 07:37:46.884 - Created modular jar: 3.com.helper.jar
[2024-10-31T07:37:47.236Z] STF 07:37:46.884 -
[2024-10-31T07:37:47.236Z] STF 07:37:46.884 - +------ Step 4 - Create com.discreet jar
[2024-10-31T07:37:47.236Z] STF 07:37:46.884 - | Create modular jar
[2024-10-31T07:37:47.236Z] STF 07:37:46.884 - | ModuleSpec: openjdk.test.modularity/bin/common-mods/com.discreet
[2024-10-31T07:37:47.236Z] STF 07:37:46.884 - | ModuleVersion: null
[2024-10-31T07:37:47.236Z] STF 07:37:46.884 - | MainClass: null
[2024-10-31T07:37:47.236Z] STF 07:37:46.884 - | HashModules: null
[2024-10-31T07:37:47.236Z] STF 07:37:46.884 - |
[2024-10-31T07:37:47.236Z] STF 07:37:46.884 - Running command: c:/workspace/workspace/Test_openjdk17_hs_sanity.system_x86-64_windows_testList_1/jdkbinary/j2sdk-image/bin/jar --create --file C:/workspace/workspace/Test_openjdk17_hs_sanity.system_x86-64_windows_testList_1/aqa-tests/TKG/output_17303582934896/PatModImg_Unex_0/20241031-073743-PatModImgTest/modules/4.com.discreet.jar -C C:\workspace\workspace\Test_openjdk17_hs_sanity.system_x86-64_windows_testList_1\jvmtest\system\aqa-systemtest\openjdk.test.modularity\bin\common-mods\com.discreet .
[2024-10-31T07:37:47.236Z] STF 07:37:46.884 - Redirecting stderr to C:/workspace/workspace/Test_openjdk17_hs_sanity.system_x86-64_windows_testList_1/aqa-tests/TKG/output_17303582934896/PatModImg_Unex_0/20241031-073743-PatModImgTest/results/4.CMJ.stderr
[2024-10-31T07:37:47.236Z] STF 07:37:46.885 - Redirecting stdout to C:/workspace/workspace/Test_openjdk17_hs_sanity.system_x86-64_windows_testList_1/aqa-tests/TKG/output_17303582934896/PatModImg_Unex_0/20241031-073743-PatModImgTest/results/4.CMJ.stdout
[2024-10-31T07:37:47.236Z] STF 07:37:46.901 - Monitoring processes: CMJ
[2024-10-31T07:37:47.561Z] STF 07:37:47.246 - Monitoring Report Summary:
[2024-10-31T07:37:47.561Z] STF 07:37:47.247 - o Process CMJ ended with the expected exit code (0)
[2024-10-31T07:37:47.561Z] STF 07:37:47.247 - Created modular jar: 4.com.discreet.jar
[2024-10-31T07:37:47.561Z] STF 07:37:47.247 -
[2024-10-31T07:37:47.561Z] STF 07:37:47.247 - +------ Step 5 - Create tests jar
[2024-10-31T07:37:47.561Z] STF 07:37:47.247 - | Create modular jar
[2024-10-31T07:37:47.561Z] STF 07:37:47.247 - | ModuleSpec: openjdk.test.modularity/bin/tests/com.test
[2024-10-31T07:37:47.561Z] STF 07:37:47.247 - | ModuleVersion: null
[2024-10-31T07:37:47.561Z] STF 07:37:47.247 - | MainClass: null
[2024-10-31T07:37:47.561Z] STF 07:37:47.247 - | HashModules: null
[2024-10-31T07:37:47.561Z] STF 07:37:47.247 - |
[2024-10-31T07:37:47.561Z] STF 07:37:47.248 - Running command: c:/workspace/workspace/Test_openjdk17_hs_sanity.system_x86-64_windows_testList_1/jdkbinary/j2sdk-image/bin/jar --create --file C:/workspace/workspace/Test_openjdk17_hs_sanity.system_x86-64_windows_testList_1/aqa-tests/TKG/output_17303582934896/PatModImg_Unex_0/20241031-073743-PatModImgTest/modules/5.com.test.jar -C C:\workspace\workspace\Test_openjdk17_hs_sanity.system_x86-64_windows_testList_1\jvmtest\system\aqa-systemtest\openjdk.test.modularity\bin\tests\com.test .
[2024-10-31T07:37:47.561Z] STF 07:37:47.248 - Redirecting stderr to C:/workspace/workspace/Test_openjdk17_hs_sanity.system_x86-64_windows_testList_1/aqa-tests/TKG/output_17303582934896/PatModImg_Unex_0/20241031-073743-PatModImgTest/results/5.CMJ.stderr
[2024-10-31T07:37:47.561Z] STF 07:37:47.248 - Redirecting stdout to C:/workspace/workspace/Test_openjdk17_hs_sanity.system_x86-64_windows_testList_1/aqa-tests/TKG/output_17303582934896/PatModImg_Unex_0/20241031-073743-PatModImgTest/results/5.CMJ.stdout
[2024-10-31T07:37:47.561Z] STF 07:37:47.255 - Monitoring processes: CMJ
[2024-10-31T07:37:47.887Z] STF 07:37:47.611 - Monitoring Report Summary:
[2024-10-31T07:37:47.887Z] STF 07:37:47.611 - o Process CMJ ended with the expected exit code (0)
[2024-10-31T07:37:47.887Z] STF 07:37:47.611 - Created modular jar: 5.com.test.jar
[2024-10-31T07:37:47.887Z] STF 07:37:47.611 -
[2024-10-31T07:37:47.887Z] STF 07:37:47.611 - +------ Step 6 - Create runtime image for PatchModule test
[2024-10-31T07:37:47.887Z] STF 07:37:47.612 - | Run jlink to create runtime image
[2024-10-31T07:37:47.887Z] STF 07:37:47.612 - | ImageName: XpJVM
[2024-10-31T07:37:47.887Z] STF 07:37:47.612 - |
[2024-10-31T07:37:47.887Z] STF 07:37:47.612 - Running command: c:/workspace/workspace/Test_openjdk17_hs_sanity.system_x86-64_windows_testList_1/jdkbinary/j2sdk-image/bin/jlink --module-path c:\workspace\workspace\Test_openjdk17_hs_sanity.system_x86-64_windows_testList_1\jdkbinary\j2sdk-image\jmods;C:\workspace\workspace\Test_openjdk17_hs_sanity.system_x86-64_windows_testList_1\aqa-tests\TKG\output_17303582934896\PatModImg_Unex_0\20241031-073743-PatModImgTest\modules --add-modules com.hello,com.hola,com.test,com.helper,com.discreet --output C:\workspace\workspace\Test_openjdk17_hs_sanity.system_x86-64_windows_testList_1\aqa-tests\TKG\output_17303582934896\PatModImg_Unex_0\20241031-073743-PatModImgTest\tmp\6.XpJVM
[2024-10-31T07:37:47.887Z] STF 07:37:47.612 - Redirecting stderr to C:/workspace/workspace/Test_openjdk17_hs_sanity.system_x86-64_windows_testList_1/aqa-tests/TKG/output_17303582934896/PatModImg_Unex_0/20241031-073743-PatModImgTest/results/6.JLNK.stderr
[2024-10-31T07:37:47.887Z] STF 07:37:47.612 - Redirecting stdout to C:/workspace/workspace/Test_openjdk17_hs_sanity.system_x86-64_windows_testList_1/aqa-tests/TKG/output_17303582934896/PatModImg_Unex_0/20241031-073743-PatModImgTest/results/6.JLNK.stdout
[2024-10-31T07:37:47.887Z] STF 07:37:47.621 - Monitoring processes: JLNK
[2024-10-31T07:37:50.775Z] STF 07:37:50.504 - Monitoring Report Summary:
[2024-10-31T07:37:50.776Z] STF 07:37:50.504 - o Process JLNK ended with the expected exit code (0)
[2024-10-31T07:37:50.776Z] STF 07:37:50.505 -
[2024-10-31T07:37:50.776Z] STF 07:37:50.505 - +------ Step 7 - Create com.hello jar
[2024-10-31T07:37:50.776Z] STF 07:37:50.505 - | Create modular jar
[2024-10-31T07:37:50.776Z] STF 07:37:50.505 - | ModuleSpec: openjdk.test.modularity/bin/common-override/com.hello
[2024-10-31T07:37:50.776Z] STF 07:37:50.505 - | ModuleVersion: null
[2024-10-31T07:37:50.776Z] STF 07:37:50.505 - | MainClass: null
[2024-10-31T07:37:50.776Z] STF 07:37:50.505 - | HashModules: null
[2024-10-31T07:37:50.776Z] STF 07:37:50.505 - |
[2024-10-31T07:37:50.776Z] STF 07:37:50.505 - Running command: c:/workspace/workspace/Test_openjdk17_hs_sanity.system_x86-64_windows_testList_1/jdkbinary/j2sdk-image/bin/jar --create --file C:/workspace/workspace/Test_openjdk17_hs_sanity.system_x86-64_windows_testList_1/aqa-tests/TKG/output_17303582934896/PatModImg_Unex_0/20241031-073743-PatModImgTest/modules/7.com.hello.jar -C C:\workspace\workspace\Test_openjdk17_hs_sanity.system_x86-64_windows_testList_1\jvmtest\system\aqa-systemtest\openjdk.test.modularity\bin\common-override\com.hello .
[2024-10-31T07:37:50.776Z] STF 07:37:50.505 - Redirecting stderr to C:/workspace/workspace/Test_openjdk17_hs_sanity.system_x86-64_windows_testList_1/aqa-tests/TKG/output_17303582934896/PatModImg_Unex_0/20241031-073743-PatModImgTest/results/7.CMJ.stderr
[2024-10-31T07:37:50.776Z] STF 07:37:50.505 - Redirecting stdout to C:/workspace/workspace/Test_openjdk17_hs_sanity.system_x86-64_windows_testList_1/aqa-tests/TKG/output_17303582934896/PatModImg_Unex_0/20241031-073743-PatModImgTest/results/7.CMJ.stdout
[2024-10-31T07:37:50.776Z] STF 07:37:50.548 - Monitoring processes: CMJ
[2024-10-31T07:37:51.105Z] STF 07:37:50.941 - Monitoring Report Summary:
[2024-10-31T07:37:51.105Z] STF 07:37:50.941 - o Process CMJ ended with the expected exit code (0)
[2024-10-31T07:37:51.105Z] STF 07:37:50.941 - Created modular jar: 7.com.hello.jar
[2024-10-31T07:37:51.105Z] STF 07:37:50.941 -
[2024-10-31T07:37:51.105Z] STF 07:37:50.941 - +------ Step 8 - create java.xml.jar
[2024-10-31T07:37:51.105Z] STF 07:37:50.941 - | Create modular jar
[2024-10-31T07:37:51.105Z] STF 07:37:50.941 - | ModuleSpec: openjdk.test.modularity/bin/common-override/java.xml
[2024-10-31T07:37:51.105Z] STF 07:37:50.941 - | ModuleVersion: null
[2024-10-31T07:37:51.105Z] STF 07:37:50.941 - | MainClass: null
[2024-10-31T07:37:51.105Z] STF 07:37:50.941 - | HashModules: null
[2024-10-31T07:37:51.105Z] STF 07:37:50.941 - |
[2024-10-31T07:37:51.105Z] STF 07:37:50.941 - Running command: c:/workspace/workspace/Test_openjdk17_hs_sanity.system_x86-64_windows_testList_1/jdkbinary/j2sdk-image/bin/jar --create --file C:/workspace/workspace/Test_openjdk17_hs_sanity.system_x86-64_windows_testList_1/aqa-tests/TKG/output_17303582934896/PatModImg_Unex_0/20241031-073743-PatModImgTest/modules/8.java.xml.jar -C C:\workspace\workspace\Test_openjdk17_hs_sanity.system_x86-64_windows_testList_1\jvmtest\system\aqa-systemtest\openjdk.test.modularity\bin\common-override\java.xml .
[2024-10-31T07:37:51.105Z] STF 07:37:50.941 - Redirecting stderr to C:/workspace/workspace/Test_openjdk17_hs_sanity.system_x86-64_windows_testList_1/aqa-tests/TKG/output_17303582934896/PatModImg_Unex_0/20241031-073743-PatModImgTest/results/8.CMJ.stderr
[2024-10-31T07:37:51.105Z] STF 07:37:50.942 - Redirecting stdout to C:/workspace/workspace/Test_openjdk17_hs_sanity.system_x86-64_windows_testList_1/aqa-tests/TKG/output_17303582934896/PatModImg_Unex_0/20241031-073743-PatModImgTest/results/8.CMJ.stdout
[2024-10-31T07:37:51.105Z] STF 07:37:50.949 - Monitoring processes: CMJ
[2024-10-31T07:37:51.428Z] STF 07:37:51.276 - Monitoring Report Summary:
[2024-10-31T07:37:51.428Z] STF 07:37:51.276 - o Process CMJ ended with the expected exit code (0)
[2024-10-31T07:37:51.428Z] STF 07:37:51.276 - Created modular jar: 8.java.xml.jar
[2024-10-31T07:37:51.428Z] STF 07:37:51.276 -
[2024-10-31T07:37:51.428Z] STF 07:37:51.276 - +------ Step 9 - (Negative test) Include a new package that is not exported and check if the public type cannot be accessed
[2024-10-31T07:37:51.428Z] STF 07:37:51.276 - | Run foreground process
[2024-10-31T07:37:51.428Z] STF 07:37:51.276 - | Program: C:/workspace/workspace/Test_openjdk17_hs_sanity.system_x86-64_windows_testList_1/aqa-tests/TKG/output_17303582934896/PatModImg_Unex_0/20241031-073743-PatModImgTest/tmp/6.XpJVM/bin/java
[2024-10-31T07:37:51.428Z] STF 07:37:51.276 - | Mnemonic: OT3
[2024-10-31T07:37:51.428Z] STF 07:37:51.276 - | Echo: ECHO_ON
[2024-10-31T07:37:51.428Z] STF 07:37:51.276 - | Expectation: NON_ZERO_EXIT [1] within 5m
[2024-10-31T07:37:51.428Z] STF 07:37:51.276 - |
[2024-10-31T07:37:51.428Z] STF 07:37:51.277 - Running command: C:/workspace/workspace/Test_openjdk17_hs_sanity.system_x86-64_windows_testList_1/aqa-tests/TKG/output_17303582934896/PatModImg_Unex_0/20241031-073743-PatModImgTest/tmp/6.XpJVM/bin/java --add-reads com.test=ALL-UNNAMED --patch-module com.hello=C:/workspace/workspace/Test_openjdk17_hs_sanity.system_x86-64_windows_testList_1/aqa-tests/TKG/output_17303582934896/PatModImg_Unex_0/20241031-073743-PatModImgTest/modules/7.com.hello.jar -XX:+UseCompressedOops -classpath c:/workspace/testDependency/system_lib/junit/junit.jar;c:/workspace/testDependency/system_lib/junit/hamcrest-core.jar org.junit.runner.JUnitCore net.adoptopenjdk.test.modularity.junit.TestOverrideUsingAppModuleAndNewPackage
[2024-10-31T07:37:51.428Z] STF 07:37:51.277 - Redirecting stderr to C:/workspace/workspace/Test_openjdk17_hs_sanity.system_x86-64_windows_testList_1/aqa-tests/TKG/output_17303582934896/PatModImg_Unex_0/20241031-073743-PatModImgTest/results/9.OT3.stderr
[2024-10-31T07:37:51.428Z] STF 07:37:51.277 - Redirecting stdout to C:/workspace/workspace/Test_openjdk17_hs_sanity.system_x86-64_windows_testList_1/aqa-tests/TKG/output_17303582934896/PatModImg_Unex_0/20241031-073743-PatModImgTest/results/9.OT3.stdout
[2024-10-31T07:37:51.428Z] STF 07:37:51.302 - Monitoring processes: OT3
[2024-10-31T07:37:51.751Z] OT3 stderr WARNING: module-info.class ignored in patch: C:\workspace\workspace\Test_openjdk17_hs_sanity.system_x86-64_windows_testList_1\aqa-tests\TKG\output_17303582934896\PatModImg_Unex_0\20241031-073743-PatModImgTest\modules\7.com.hello.jar
[2024-10-31T07:37:51.751Z] OT3 JUnit version 4.12
[2024-10-31T07:37:51.751Z] OT3 .E
[2024-10-31T07:37:52.080Z] OT3 Time: 0.01
[2024-10-31T07:37:52.080Z] OT3 There was 1 failure:
[2024-10-31T07:37:52.080Z] OT3 1) testOverrideUsingAppModuleAndNewPackage(net.adoptopenjdk.test.modularity.junit.TestOverrideUsingAppModuleAndNewPackage)
[2024-10-31T07:37:52.080Z] OT3 java.lang.IllegalAccessException: class net.adoptopenjdk.test.modularity.junit.TestOverrideUsingAppModuleAndNewPackage (in module com.test) cannot access class adoptopenjdk.test.modularity.hellonew.HelloNew (in module com.hello) because module com.hello does not export adoptopenjdk.test.modularity.hellonew to module com.test
[2024-10-31T07:37:52.080Z] OT3 at java.base/jdk.internal.reflect.Reflection.newIllegalAccessException(Reflection.java:392)
[2024-10-31T07:37:52.080Z] OT3 at java.base/java.lang.reflect.AccessibleObject.checkAccess(AccessibleObject.java:674)
[2024-10-31T07:37:52.080Z] OT3 at java.base/java.lang.reflect.Constructor.newInstanceWithCaller(Constructor.java:490)
[2024-10-31T07:37:52.080Z] OT3 at java.base/java.lang.reflect.Constructor.newInstance(Constructor.java:481)
[2024-10-31T07:37:52.080Z] OT3 at com.test/net.adoptopenjdk.test.modularity.junit.TestOverrideUsingAppModuleAndNewPackage.testOverrideUsingAppModuleAndNewPackage(TestOverrideUsingAppModuleAndNewPackage.java:31)
[2024-10-31T07:37:52.080Z] OT3 at java.base/jdk.internal.reflect.NativeMethodAccessorImpl.invoke0(Native Method)
[2024-10-31T07:37:52.080Z] OT3 at java.base/jdk.internal.reflect.NativeMethodAccessorImpl.invoke(NativeMethodAccessorImpl.java:77)
[2024-10-31T07:37:52.080Z] OT3 at java.base/jdk.internal.reflect.DelegatingMethodAccessorImpl.invoke(DelegatingMethodAccessorImpl.java:43)
[2024-10-31T07:37:52.080Z] OT3 at java.base/java.lang.reflect.Method.invoke(Method.java:569)
[2024-10-31T07:37:52.080Z] OT3 at org.junit.runners.model.FrameworkMethod$1.runReflectiveCall(FrameworkMethod.java:50)
[2024-10-31T07:37:52.080Z] OT3 at org.junit.internal.runners.model.ReflectiveCallable.run(ReflectiveCallable.java:12)
[2024-10-31T07:37:52.080Z] OT3 at org.junit.runners.model.FrameworkMethod.invokeExplosively(FrameworkMethod.java:47)
[2024-10-31T07:37:52.080Z] OT3 at org.junit.internal.runners.statements.InvokeMethod.evaluate(InvokeMethod.java:17)
[2024-10-31T07:37:52.080Z] OT3 at org.junit.runners.ParentRunner.runLeaf(ParentRunner.java:325)
[2024-10-31T07:37:52.080Z] OT3 at org.junit.runners.BlockJUnit4ClassRunner.runChild(BlockJUnit4ClassRunner.java:78)
[2024-10-31T07:37:52.080Z] OT3 at org.junit.runners.BlockJUnit4ClassRunner.runChild(BlockJUnit4ClassRunner.java:57)
[2024-10-31T07:37:52.080Z] OT3 at org.junit.runners.ParentRunner$3.run(ParentRunner.java:290)
[2024-10-31T07:37:52.080Z] OT3 at org.junit.runners.ParentRunner$1.schedule(ParentRunner.java:71)
[2024-10-31T07:37:52.080Z] OT3 at org.junit.runners.ParentRunner.runChildren(ParentRunner.java:288)
[2024-10-31T07:37:52.080Z] OT3 at org.junit.runners.ParentRunner.access$000(ParentRunner.java:58)
[2024-10-31T07:37:52.080Z] OT3 at org.junit.runners.ParentRunner$2.evaluate(ParentRunner.java:268)
[2024-10-31T07:37:52.080Z] OT3 at org.junit.runners.ParentRunner.run(ParentRunner.java:363)
[2024-10-31T07:37:52.080Z] OT3 at org.junit.runners.Suite.runChild(Suite.java:128)
[2024-10-31T07:37:52.080Z] OT3 at org.junit.runners.Suite.runChild(Suite.java:27)
[2024-10-31T07:37:52.080Z] OT3 at org.junit.runners.ParentRunner$3.run(ParentRunner.java:290)
[2024-10-31T07:37:52.080Z] OT3 at org.junit.runners.ParentRunner$1.schedule(ParentRunner.java:71)
[2024-10-31T07:37:52.080Z] OT3 at org.junit.runners.ParentRunner.runChildren(ParentRunner.java:288)
[2024-10-31T07:37:52.080Z] OT3 at org.junit.runners.ParentRunner.access$000(ParentRunner.java:58)
[2024-10-31T07:37:52.080Z] OT3 at org.junit.runners.ParentRunner$2.evaluate(ParentRunner.java:268)
[2024-10-31T07:37:52.080Z] OT3 at org.junit.runners.ParentRunner.run(ParentRunner.java:363)
[2024-10-31T07:37:52.080Z] OT3 at org.junit.runner.JUnitCore.run(JUnitCore.java:137)
[2024-10-31T07:37:52.080Z] OT3 at org.junit.runner.JUnitCore.run(JUnitCore.java:115)
[2024-10-31T07:37:52.080Z] OT3 at org.junit.runner.JUnitCore.runMain(JUnitCore.java:77)
[2024-10-31T07:37:52.080Z] OT3 at org.junit.runner.JUnitCore.main(JUnitCore.java:36)
[2024-10-31T07:37:52.080Z] OT3
[2024-10-31T07:37:52.080Z] OT3 FAILURES!!!
[2024-10-31T07:37:52.080Z] OT3 Tests run: 1, Failures: 1
[2024-10-31T07:37:52.080Z] OT3
[2024-10-31T07:37:52.080Z] STF 07:37:51.728 - Monitoring Report Summary:
[2024-10-31T07:37:52.080Z] STF 07:37:51.728 - o Process OT3 ended with the expected exit code (1)
[2024-10-31T07:37:52.080Z] STF 07:37:51.728 -
[2024-10-31T07:37:52.080Z] STF 07:37:51.728 - +------ Step 10 - Check output
[2024-10-31T07:37:52.080Z] STF 07:37:51.728 - | Count file matches
[2024-10-31T07:37:52.080Z] STF 07:37:51.728 - | TargetFile: C:/workspace/workspace/Test_openjdk17_hs_sanity.system_x86-64_windows_testList_1/aqa-tests/TKG/output_17303582934896/PatModImg_Unex_0/20241031-073743-PatModImgTest/results/9.OT3.stdout
[2024-10-31T07:37:52.080Z] STF 07:37:51.728 - | ExpectedNumMatches: 1
[2024-10-31T07:37:52.080Z] STF 07:37:51.728 - | SearchStrings: ["java.lang.IllegalAccessException"]
[2024-10-31T07:37:52.080Z] STF 07:37:51.728 - |
[2024-10-31T07:37:52.080Z] STF 07:37:51.729 - Found 1 instances of ["java.lang.IllegalAccessException"]
[2024-10-31T07:37:52.080Z] STF 07:37:51.729 -
[2024-10-31T07:37:52.080Z] STF 07:37:51.729 - +------ Step 11 - Include a new package that is not exported and check if the public type can be accessed by adding --add-exports
[2024-10-31T07:37:52.080Z] STF 07:37:51.729 - | Run foreground process
[2024-10-31T07:37:52.080Z] STF 07:37:51.729 - | Program: C:/workspace/workspace/Test_openjdk17_hs_sanity.system_x86-64_windows_testList_1/aqa-tests/TKG/output_17303582934896/PatModImg_Unex_0/20241031-073743-PatModImgTest/tmp/6.XpJVM/bin/java
[2024-10-31T07:37:52.080Z] STF 07:37:51.729 - | Mnemonic: OT4
[2024-10-31T07:37:52.080Z] STF 07:37:51.729 - | Echo: ECHO_ON
[2024-10-31T07:37:52.080Z] STF 07:37:51.729 - | Expectation: CLEAN_RUN within 5m
[2024-10-31T07:37:52.080Z] STF 07:37:51.729 - |
[2024-10-31T07:37:52.080Z] STF 07:37:51.729 - Running command: C:/workspace/workspace/Test_openjdk17_hs_sanity.system_x86-64_windows_testList_1/aqa-tests/TKG/output_17303582934896/PatModImg_Unex_0/20241031-073743-PatModImgTest/tmp/6.XpJVM/bin/java --add-reads com.test=ALL-UNNAMED --add-exports com.hello/adoptopenjdk.test.modularity.hellonew=com.test --patch-module com.hello=C:/workspace/workspace/Test_openjdk17_hs_sanity.system_x86-64_windows_testList_1/aqa-tests/TKG/output_17303582934896/PatModImg_Unex_0/20241031-073743-PatModImgTest/modules/7.com.hello.jar -XX:+UseCompressedOops -classpath c:/workspace/testDependency/system_lib/junit/junit.jar;c:/workspace/testDependency/system_lib/junit/hamcrest-core.jar org.junit.runner.JUnitCore net.adoptopenjdk.test.modularity.junit.TestOverrideUsingAppModuleAndNewPackage
[2024-10-31T07:37:52.080Z] STF 07:37:51.729 - Redirecting stderr to C:/workspace/workspace/Test_openjdk17_hs_sanity.system_x86-64_windows_testList_1/aqa-tests/TKG/output_17303582934896/PatModImg_Unex_0/20241031-073743-PatModImgTest/results/11.OT4.stderr
[2024-10-31T07:37:52.080Z] STF 07:37:51.729 - Redirecting stdout to C:/workspace/workspace/Test_openjdk17_hs_sanity.system_x86-64_windows_testList_1/aqa-tests/TKG/output_17303582934896/PatModImg_Unex_0/20241031-073743-PatModImgTest/results/11.OT4.stdout
[2024-10-31T07:37:52.080Z] STF 07:37:51.738 - Monitoring processes: OT4
[2024-10-31T07:37:52.080Z] OT4 stderr WARNING: module-info.class ignored in patch: C:\workspace\workspace\Test_openjdk17_hs_sanity.system_x86-64_windows_testList_1\aqa-tests\TKG\output_17303582934896\PatModImg_Unex_0\20241031-073743-PatModImgTest\modules\7.com.hello.jar
[2024-10-31T07:37:52.080Z] OT4 JUnit version 4.12
[2024-10-31T07:37:52.485Z] OT4 .
[2024-10-31T07:37:52.485Z] OT4 Time: 0.007
[2024-10-31T07:37:52.485Z] OT4
[2024-10-31T07:37:52.485Z] OT4 OK (1 test)
[2024-10-31T07:37:52.485Z] OT4
[2024-10-31T07:37:52.485Z] STF 07:37:52.121 - Monitoring Report Summary:
[2024-10-31T07:37:52.485Z] STF 07:37:52.121 - o Process OT4 ended with the expected exit code (0)
[2024-10-31T07:37:52.485Z] STF 07:37:52.121 - EXECUTE stage completed
[2024-10-31T07:37:52.485Z] STF 07:37:52.149 -
[2024-10-31T07:37:52.485Z] STF 07:37:52.149 - ==================== T E A R D O W N ====================
[2024-10-31T07:37:52.485Z] STF 07:37:52.149 - Running teardown: perl C:/workspace/workspace/Test_openjdk17_hs_sanity.system_x86-64_windows_testList_1/aqa-tests/\TKG\output_17303582934896\PatModImg_Unex_0/20241031-073743-PatModImgTest/tearDown.pl
[2024-10-31T07:37:52.485Z] STF 07:37:52.333 - TEARDOWN stage completed
[2024-10-31T07:37:52.485Z] STF 07:37:52.349 -
[2024-10-31T07:37:52.485Z] STF 07:37:52.349 - ===================== R E S U L T S =====================
[2024-10-31T07:37:52.486Z] STF 07:37:52.349 - Stage results:
[2024-10-31T07:37:52.486Z] STF 07:37:52.349 - setUp: pass
[2024-10-31T07:37:52.486Z] STF 07:37:52.349 - execute: pass
[2024-10-31T07:37:52.486Z] STF 07:37:52.349 - teardown: pass
[2024-10-31T07:37:52.486Z] STF 07:37:52.349 -
[2024-10-31T07:37:52.486Z] STF 07:37:52.349 - Overall result: PASSED
[2024-10-31T07:37:52.486Z] -----------------------------------
[2024-10-31T07:37:52.486Z] PatModImg_Unex_0_PASSED
[2024-10-31T07:37:52.486Z] -----------------------------------
[2024-10-31T07:37:52.858Z]
[2024-10-31T07:37:52.858Z] TEST TEARDOWN:
[2024-10-31T07:37:52.858Z] Nothing to be done for teardown.
[2024-10-31T07:37:52.858Z] PatModImg_Unex_0 Finish Time: Thu Oct 31 07:37:52 2024 Epoch Time (ms): 1730360272749