PatMod_Adv_1
[2024-09-04T21:14:12.687Z] Running test PatMod_Adv_1 ...
[2024-09-04T21:14:12.687Z] ===============================================
[2024-09-04T21:14:12.687Z] PatMod_Adv_1 Start Time: Wed Sep 4 17:14:12 2024 Epoch Time (ms): 1725484452272
[2024-09-04T21:14:12.687Z] variation: Mode650
[2024-09-04T21:14:12.687Z] JVM_OPTIONS: -XX:-UseCompressedOops
[2024-09-04T21:14:12.687Z] { \
[2024-09-04T21:14:12.687Z] echo ""; echo "TEST SETUP:"; \
[2024-09-04T21:14:12.687Z] echo "Nothing to be done for setup."; \
[2024-09-04T21:14:12.687Z] mkdir -p "/Users/admin/workspace/workspace/Test_openjdk17_hs_sanity.system_aarch64_mac_testList_1/aqa-tests/TKG/../TKG/output_17254819871481/PatMod_Adv_1"; \
[2024-09-04T21:14:12.687Z] cd "/Users/admin/workspace/workspace/Test_openjdk17_hs_sanity.system_aarch64_mac_testList_1/aqa-tests/TKG/../TKG/output_17254819871481/PatMod_Adv_1"; \
[2024-09-04T21:14:12.687Z] echo ""; echo "TESTING:"; \
[2024-09-04T21:14:12.687Z] perl /Users/admin/workspace/workspace/Test_openjdk17_hs_sanity.system_aarch64_mac_testList_1/aqa-tests/TKG/../../jvmtest/system/modularity/..//STF/stf.core/scripts/stf.pl -test-root="/Users/admin/workspace/workspace/Test_openjdk17_hs_sanity.system_aarch64_mac_testList_1/aqa-tests/TKG/../../jvmtest/system/modularity/..//STF;/Users/admin/workspace/workspace/Test_openjdk17_hs_sanity.system_aarch64_mac_testList_1/aqa-tests/TKG/../../jvmtest/system/modularity/..//aqa-systemtest""" -systemtest-prereqs="/Users/admin/workspace/workspace/Test_openjdk17_hs_sanity.system_aarch64_mac_testList_1/../../testDependency/system_lib/" -java-args=' -XX:-UseCompressedOops ' -results-root="/Users/admin/workspace/workspace/Test_openjdk17_hs_sanity.system_aarch64_mac_testList_1/aqa-tests/TKG/../TKG/output_17254819871481/PatMod_Adv_1" -test=PatModTest -test-args="variant=Adv"; \
[2024-09-04T21:14:12.687Z] if [ $? -eq 0 ]; then echo "-----------------------------------"; echo "PatMod_Adv_1""_PASSED"; echo "-----------------------------------"; cd /Users/admin/workspace/workspace/Test_openjdk17_hs_sanity.system_aarch64_mac_testList_1/aqa-tests/TKG/..; rm -f -r "/Users/admin/workspace/workspace/Test_openjdk17_hs_sanity.system_aarch64_mac_testList_1/aqa-tests/TKG/../TKG/output_17254819871481/PatMod_Adv_1"; else echo "-----------------------------------"; echo "PatMod_Adv_1""_FAILED"; echo "-----------------------------------"; fi; \
[2024-09-04T21:14:12.687Z] echo ""; echo "TEST TEARDOWN:"; \
[2024-09-04T21:14:12.687Z] echo "Nothing to be done for teardown."; \
[2024-09-04T21:14:12.687Z] } 2>&1 | tee -a "/Users/admin/workspace/workspace/Test_openjdk17_hs_sanity.system_aarch64_mac_testList_1/aqa-tests/TKG/../TKG/output_17254819871481/TestTargetResult";
[2024-09-04T21:14:12.687Z]
[2024-09-04T21:14:12.687Z] TEST SETUP:
[2024-09-04T21:14:12.687Z] Nothing to be done for setup.
[2024-09-04T21:14:12.687Z]
[2024-09-04T21:14:12.687Z] TESTING:
[2024-09-04T21:14:12.687Z] STF 17:14:12.313 - ========================= S T F =========================
[2024-09-04T21:14:12.687Z] systemtest-prereqs has been processed, and set to: /Users/admin/workspace/testDependency/system_libRetrieving amount of free space on drive containing /Users/admin/workspace/workspace/Test_openjdk17_hs_sanity.system_aarch64_mac_testList_1/aqa-tests/TKG/../TKG/output_17254819871481/PatMod_Adv_1
[2024-09-04T21:14:12.687Z] There is 28665 Mb free
[2024-09-04T21:14:12.687Z] STF 17:14:12.317 - ================== G E N E R A T I O N ==================
[2024-09-04T21:14:12.687Z] STF 17:14:12.317 - Checking JVM: /Users/admin/workspace/workspace/Test_openjdk17_hs_sanity.system_aarch64_mac_testList_1/jdkbinary/j2sdk-image/Contents/Home/bin/../
[2024-09-04T21:14:12.688Z] STF 17:14:12.317 - Starting process to generate scripts: /Users/admin/workspace/workspace/Test_openjdk17_hs_sanity.system_aarch64_mac_testList_1/jdkbinary/j2sdk-image/Contents/Home/bin/..//bin/java -Dlog4j.skipJansi=true -Djava.system.class.loader=net.adoptopenjdk.stf.runner.StfClassLoader -classpath /Users/admin/workspace/workspace/Test_openjdk17_hs_sanity.system_aarch64_mac_testList_1/../../testDependency/system_lib//log4j/log4j-api.jar:/Users/admin/workspace/workspace/Test_openjdk17_hs_sanity.system_aarch64_mac_testList_1/../../testDependency/system_lib//log4j/log4j-core.jar:/Users/admin/workspace/workspace/Test_openjdk17_hs_sanity.system_aarch64_mac_testList_1/jvmtest/system/STF/stf.core/scripts/../bin net.adoptopenjdk.stf.runner.StfRunner -properties "/Users/admin/workspace/workspace/Test_openjdk17_hs_sanity.system_aarch64_mac_testList_1/aqa-tests/TKG/../TKG/output_17254819871481/PatMod_Adv_1/20240904-171412-PatModTest/stf_parameters.properties, , /Users/admin/workspace/workspace/Test_openjdk17_hs_sanity.system_aarch64_mac_testList_1/jvmtest/system/STF/stf.core/config/stf.properties" -testDir "/Users/admin/workspace/workspace/Test_openjdk17_hs_sanity.system_aarch64_mac_testList_1/aqa-tests/TKG/../TKG/output_17254819871481/PatMod_Adv_1/20240904-171412-PatModTest"
[2024-09-04T21:14:12.688Z] GEN stderr OpenJDK 64-Bit Server VM warning: Archived non-system classes are disabled because the java.system.class.loader property is specified (value = "net.adoptopenjdk.stf.runner.StfClassLoader"). To use archived non-system classes, this property must not be set
[2024-09-04T21:14:13.047Z] GEN 17:14:12.619 - Found test. Project: 'openjdk.test.modularity' class: 'PatModTest.class' Dir: '/Users/admin/workspace/workspace/Test_openjdk17_hs_sanity.system_aarch64_mac_testList_1/jvmtest/system/aqa-systemtest/openjdk.test.modularity/bin'
[2024-09-04T21:14:13.047Z] GEN 17:14:12.626 - Found test. Project: 'openjdk.test.modularity' class: 'net.adoptopenjdk.test.modularity.PatModTest'
[2024-09-04T21:14:13.048Z] GEN Classpath directories used by project 'openjdk.test.modularity':
[2024-09-04T21:14:13.048Z] GEN /Users/admin/workspace/workspace/Test_openjdk17_hs_sanity.system_aarch64_mac_testList_1/jvmtest/system/aqa-systemtest/openjdk.test.modularity/bin/common-mods/displayService
[2024-09-04T21:14:13.048Z] GEN /Users/admin/workspace/workspace/Test_openjdk17_hs_sanity.system_aarch64_mac_testList_1/jvmtest/system/aqa-systemtest/openjdk.test.modularity/bin/common-mods/com.helper
[2024-09-04T21:14:13.048Z] GEN /Users/admin/workspace/workspace/Test_openjdk17_hs_sanity.system_aarch64_mac_testList_1/jvmtest/system/aqa-systemtest/openjdk.test.modularity/bin/common-mods/displayServiceImpl1
[2024-09-04T21:14:13.048Z] GEN /Users/admin/workspace/workspace/Test_openjdk17_hs_sanity.system_aarch64_mac_testList_1/jvmtest/system/aqa-systemtest/openjdk.test.modularity/bin/common-mods/com.discreet
[2024-09-04T21:14:13.048Z] GEN /Users/admin/workspace/workspace/Test_openjdk17_hs_sanity.system_aarch64_mac_testList_1/jvmtest/system/aqa-systemtest/openjdk.test.modularity/bin/common-mods/com.hello
[2024-09-04T21:14:13.048Z] GEN /Users/admin/workspace/workspace/Test_openjdk17_hs_sanity.system_aarch64_mac_testList_1/jvmtest/system/aqa-systemtest/openjdk.test.modularity/bin/common-mods/com.hola
[2024-09-04T21:14:13.048Z] GEN /Users/admin/workspace/workspace/Test_openjdk17_hs_sanity.system_aarch64_mac_testList_1/jvmtest/system/aqa-systemtest/openjdk.test.modularity/bin/common-mods/displayServiceImpl2
[2024-09-04T21:14:13.048Z] GEN /Users/admin/workspace/workspace/Test_openjdk17_hs_sanity.system_aarch64_mac_testList_1/jvmtest/system/aqa-systemtest/openjdk.test.modularity/bin/common-mods/com.hi
[2024-09-04T21:14:13.048Z] GEN /Users/admin/workspace/workspace/Test_openjdk17_hs_sanity.system_aarch64_mac_testList_1/jvmtest/system/aqa-systemtest/openjdk.test.modularity/bin/common-override
[2024-09-04T21:14:13.048Z] GEN /Users/admin/workspace/workspace/Test_openjdk17_hs_sanity.system_aarch64_mac_testList_1/jvmtest/system/aqa-systemtest/openjdk.test.modularity/bin/common-override-new
[2024-09-04T21:14:13.048Z] GEN /Users/admin/workspace/workspace/Test_openjdk17_hs_sanity.system_aarch64_mac_testList_1/jvmtest/system/aqa-systemtest/openjdk.test.modularity/bin/common/displayServiceImpl3
[2024-09-04T21:14:13.048Z] GEN /Users/admin/workspace/workspace/Test_openjdk17_hs_sanity.system_aarch64_mac_testList_1/jvmtest/system/aqa-systemtest/openjdk.test.modularity/bin/common/displayServiceImpl4
[2024-09-04T21:14:13.048Z] GEN /Users/admin/workspace/workspace/Test_openjdk17_hs_sanity.system_aarch64_mac_testList_1/jvmtest/system/aqa-systemtest/openjdk.test.modularity/bin/common
[2024-09-04T21:14:13.048Z] GEN /Users/admin/workspace/workspace/Test_openjdk17_hs_sanity.system_aarch64_mac_testList_1/jvmtest/system/aqa-systemtest/openjdk.test.modularity/bin/tests
[2024-09-04T21:14:13.048Z] GEN /Users/admin/workspace/workspace/Test_openjdk17_hs_sanity.system_aarch64_mac_testList_1/jvmtest/system/aqa-systemtest/openjdk.test.modularity/bin
[2024-09-04T21:14:13.048Z] GEN /Users/admin/workspace/workspace/Test_openjdk17_hs_sanity.system_aarch64_mac_testList_1/jvmtest/system/STF/stf.core/bin
[2024-09-04T21:14:13.048Z] GEN /Users/admin/workspace/testDependency/system_lib/log4j/log4j-api.jar
[2024-09-04T21:14:13.048Z] GEN /Users/admin/workspace/testDependency/system_lib/log4j/log4j-core.jar
[2024-09-04T21:14:13.048Z] GEN /Users/admin/workspace/testDependency/system_lib/junit/junit.jar
[2024-09-04T21:14:13.048Z] GEN 17:14:12.685 - Using Mode NoOptions. Values = ''
[2024-09-04T21:14:13.048Z] GEN 17:14:12.709 -
[2024-09-04T21:14:13.048Z] GEN 17:14:12.709 - Test command summary:
[2024-09-04T21:14:13.048Z] GEN 17:14:12.709 - Step Stage Command Description
[2024-09-04T21:14:13.048Z] GEN 17:14:12.709 - -----+--------+-----------------+------------
[2024-09-04T21:14:13.048Z] GEN 17:14:12.709 - 1 execute jar Create com.hello jar
[2024-09-04T21:14:13.048Z] GEN 17:14:12.709 - 2 execute jar Create com.discreet jar
[2024-09-04T21:14:13.048Z] GEN 17:14:12.709 - 3 execute jar create java.xml.jar
[2024-09-04T21:14:13.048Z] GEN 17:14:12.709 - 4 execute Run java Run application class override test where we specify two exploded module paths in a single --patch-module option
[2024-09-04T21:14:13.048Z] GEN 17:14:12.709 - 5 execute Run java (Negative test) Verify if a module can be specified only once on --patch-module
[2024-09-04T21:14:13.048Z] GEN 17:14:12.709 - 6 execute Run java Combine stderr and stdout files of process OT7
[2024-09-04T21:14:13.048Z] GEN 17:14:12.709 - 7 execute count Check output
[2024-09-04T21:14:13.048Z] GEN 17:14:12.709 - 8 execute Run java (Negative test) Verify if --patch-module allows replacing of module-info.class
[2024-09-04T21:14:13.048Z] GEN 17:14:12.709 - 9 execute count Check output
[2024-09-04T21:14:13.048Z] STF 17:14:12.737 -
[2024-09-04T21:14:13.048Z] STF 17:14:12.737 - Script generation completed
[2024-09-04T21:14:13.048Z] STF 17:14:12.737 -
[2024-09-04T21:14:13.048Z] STF 17:14:12.737 -
[2024-09-04T21:14:13.048Z] STF 17:14:12.737 - ======================= S E T U P =======================
[2024-09-04T21:14:13.048Z] STF 17:14:12.737 - Running setup: perl /Users/admin/workspace/workspace/Test_openjdk17_hs_sanity.system_aarch64_mac_testList_1/aqa-tests/TKG/../TKG/output_17254819871481/PatMod_Adv_1/20240904-171412-PatModTest/setUp.pl
[2024-09-04T21:14:13.048Z] STF 17:14:12.765 - SETUP stage completed
[2024-09-04T21:14:13.048Z] STF 17:14:12.773 -
[2024-09-04T21:14:13.048Z] STF 17:14:12.773 - ==================== E X E C U T E - ====================
[2024-09-04T21:14:13.048Z] STF 17:14:12.773 - Running execute: perl /Users/admin/workspace/workspace/Test_openjdk17_hs_sanity.system_aarch64_mac_testList_1/aqa-tests/TKG/../TKG/output_17254819871481/PatMod_Adv_1/20240904-171412-PatModTest/execute.pl
[2024-09-04T21:14:13.048Z] STF 17:14:12.801 -
[2024-09-04T21:14:13.048Z] STF 17:14:12.801 - Java version
[2024-09-04T21:14:13.048Z] STF 17:14:12.801 - Running: /Users/admin/workspace/workspace/Test_openjdk17_hs_sanity.system_aarch64_mac_testList_1/jdkbinary/j2sdk-image/Contents/Home/bin/java -version
[2024-09-04T21:14:13.048Z] openjdk version "17.0.13-beta" 2024-10-15
[2024-09-04T21:14:13.048Z] OpenJDK Runtime Environment Temurin-17.0.13+6-202409041934 (build 17.0.13-beta+6-ea)
[2024-09-04T21:14:13.048Z] OpenJDK 64-Bit Server VM Temurin-17.0.13+6-202409041934 (build 17.0.13-beta+6-ea, mixed mode, sharing)
[2024-09-04T21:14:13.048Z] STF 17:14:12.828 -
[2024-09-04T21:14:13.048Z] STF 17:14:12.828 - +------ Step 1 - Create com.hello jar
[2024-09-04T21:14:13.048Z] STF 17:14:12.828 - | Create modular jar
[2024-09-04T21:14:13.048Z] STF 17:14:12.828 - | ModuleSpec: openjdk.test.modularity/bin/common-override/com.hello
[2024-09-04T21:14:13.048Z] STF 17:14:12.828 - | ModuleVersion: null
[2024-09-04T21:14:13.048Z] STF 17:14:12.828 - | MainClass: null
[2024-09-04T21:14:13.048Z] STF 17:14:12.828 - | HashModules: null
[2024-09-04T21:14:13.048Z] STF 17:14:12.828 - |
[2024-09-04T21:14:13.048Z] STF 17:14:12.828 - Running command: /Users/admin/workspace/workspace/Test_openjdk17_hs_sanity.system_aarch64_mac_testList_1/jdkbinary/j2sdk-image/Contents/Home/bin/jar --create --file /Users/admin/workspace/workspace/Test_openjdk17_hs_sanity.system_aarch64_mac_testList_1/aqa-tests/TKG/output_17254819871481/PatMod_Adv_1/20240904-171412-PatModTest/modules/1.com.hello.jar -C /Users/admin/workspace/workspace/Test_openjdk17_hs_sanity.system_aarch64_mac_testList_1/jvmtest/system/aqa-systemtest/openjdk.test.modularity/bin/common-override/com.hello .
[2024-09-04T21:14:13.049Z] STF 17:14:12.828 - Redirecting stderr to /Users/admin/workspace/workspace/Test_openjdk17_hs_sanity.system_aarch64_mac_testList_1/aqa-tests/TKG/output_17254819871481/PatMod_Adv_1/20240904-171412-PatModTest/results/1.CMJ.stderr
[2024-09-04T21:14:13.049Z] STF 17:14:12.828 - Redirecting stdout to /Users/admin/workspace/workspace/Test_openjdk17_hs_sanity.system_aarch64_mac_testList_1/aqa-tests/TKG/output_17254819871481/PatMod_Adv_1/20240904-171412-PatModTest/results/1.CMJ.stdout
[2024-09-04T21:14:13.049Z] STF 17:14:12.833 - Monitoring processes: CMJ
[2024-09-04T21:14:13.406Z] STF 17:14:12.913 - Monitoring Report Summary:
[2024-09-04T21:14:13.406Z] STF 17:14:12.913 - o Process CMJ ended with the expected exit code (0)
[2024-09-04T21:14:13.406Z] STF 17:14:12.913 - Created modular jar: 1.com.hello.jar
[2024-09-04T21:14:13.406Z] STF 17:14:12.913 -
[2024-09-04T21:14:13.406Z] STF 17:14:12.913 - +------ Step 2 - Create com.discreet jar
[2024-09-04T21:14:13.406Z] STF 17:14:12.913 - | Create modular jar
[2024-09-04T21:14:13.406Z] STF 17:14:12.913 - | ModuleSpec: openjdk.test.modularity/bin/common-override/com.discreet
[2024-09-04T21:14:13.406Z] STF 17:14:12.913 - | ModuleVersion: null
[2024-09-04T21:14:13.406Z] STF 17:14:12.913 - | MainClass: null
[2024-09-04T21:14:13.406Z] STF 17:14:12.913 - | HashModules: null
[2024-09-04T21:14:13.406Z] STF 17:14:12.913 - |
[2024-09-04T21:14:13.406Z] STF 17:14:12.913 - Running command: /Users/admin/workspace/workspace/Test_openjdk17_hs_sanity.system_aarch64_mac_testList_1/jdkbinary/j2sdk-image/Contents/Home/bin/jar --create --file /Users/admin/workspace/workspace/Test_openjdk17_hs_sanity.system_aarch64_mac_testList_1/aqa-tests/TKG/output_17254819871481/PatMod_Adv_1/20240904-171412-PatModTest/modules/2.com.discreet.jar -C /Users/admin/workspace/workspace/Test_openjdk17_hs_sanity.system_aarch64_mac_testList_1/jvmtest/system/aqa-systemtest/openjdk.test.modularity/bin/common-override/com.discreet .
[2024-09-04T21:14:13.406Z] STF 17:14:12.913 - Redirecting stderr to /Users/admin/workspace/workspace/Test_openjdk17_hs_sanity.system_aarch64_mac_testList_1/aqa-tests/TKG/output_17254819871481/PatMod_Adv_1/20240904-171412-PatModTest/results/2.CMJ.stderr
[2024-09-04T21:14:13.406Z] STF 17:14:12.913 - Redirecting stdout to /Users/admin/workspace/workspace/Test_openjdk17_hs_sanity.system_aarch64_mac_testList_1/aqa-tests/TKG/output_17254819871481/PatMod_Adv_1/20240904-171412-PatModTest/results/2.CMJ.stdout
[2024-09-04T21:14:13.406Z] STF 17:14:12.914 - Monitoring processes: CMJ
[2024-09-04T21:14:13.406Z] STF 17:14:12.998 - Monitoring Report Summary:
[2024-09-04T21:14:13.406Z] STF 17:14:12.998 - o Process CMJ ended with the expected exit code (0)
[2024-09-04T21:14:13.406Z] STF 17:14:12.998 - Created modular jar: 2.com.discreet.jar
[2024-09-04T21:14:13.406Z] STF 17:14:12.998 -
[2024-09-04T21:14:13.406Z] STF 17:14:12.998 - +------ Step 3 - create java.xml.jar
[2024-09-04T21:14:13.406Z] STF 17:14:12.998 - | Create modular jar
[2024-09-04T21:14:13.406Z] STF 17:14:12.998 - | ModuleSpec: openjdk.test.modularity/bin/common-override/java.xml
[2024-09-04T21:14:13.406Z] STF 17:14:12.998 - | ModuleVersion: null
[2024-09-04T21:14:13.406Z] STF 17:14:12.998 - | MainClass: null
[2024-09-04T21:14:13.406Z] STF 17:14:12.998 - | HashModules: null
[2024-09-04T21:14:13.406Z] STF 17:14:12.998 - |
[2024-09-04T21:14:13.406Z] STF 17:14:12.998 - Running command: /Users/admin/workspace/workspace/Test_openjdk17_hs_sanity.system_aarch64_mac_testList_1/jdkbinary/j2sdk-image/Contents/Home/bin/jar --create --file /Users/admin/workspace/workspace/Test_openjdk17_hs_sanity.system_aarch64_mac_testList_1/aqa-tests/TKG/output_17254819871481/PatMod_Adv_1/20240904-171412-PatModTest/modules/3.java.xml.jar -C /Users/admin/workspace/workspace/Test_openjdk17_hs_sanity.system_aarch64_mac_testList_1/jvmtest/system/aqa-systemtest/openjdk.test.modularity/bin/common-override/java.xml .
[2024-09-04T21:14:13.406Z] STF 17:14:12.998 - Redirecting stderr to /Users/admin/workspace/workspace/Test_openjdk17_hs_sanity.system_aarch64_mac_testList_1/aqa-tests/TKG/output_17254819871481/PatMod_Adv_1/20240904-171412-PatModTest/results/3.CMJ.stderr
[2024-09-04T21:14:13.406Z] STF 17:14:12.998 - Redirecting stdout to /Users/admin/workspace/workspace/Test_openjdk17_hs_sanity.system_aarch64_mac_testList_1/aqa-tests/TKG/output_17254819871481/PatMod_Adv_1/20240904-171412-PatModTest/results/3.CMJ.stdout
[2024-09-04T21:14:13.406Z] STF 17:14:12.999 - Monitoring processes: CMJ
[2024-09-04T21:14:13.406Z] STF 17:14:13.079 - Monitoring Report Summary:
[2024-09-04T21:14:13.406Z] STF 17:14:13.080 - o Process CMJ ended with the expected exit code (0)
[2024-09-04T21:14:13.406Z] STF 17:14:13.080 - Created modular jar: 3.java.xml.jar
[2024-09-04T21:14:13.406Z] STF 17:14:13.080 -
[2024-09-04T21:14:13.406Z] STF 17:14:13.080 - +------ Step 4 - Run application class override test where we specify two exploded module paths in a single --patch-module option
[2024-09-04T21:14:13.406Z] STF 17:14:13.080 - | Run foreground process
[2024-09-04T21:14:13.406Z] STF 17:14:13.080 - | Program: /Users/admin/workspace/workspace/Test_openjdk17_hs_sanity.system_aarch64_mac_testList_1/jdkbinary/j2sdk-image/Contents/Home/bin/java
[2024-09-04T21:14:13.406Z] STF 17:14:13.080 - | Mnemonic: OT56
[2024-09-04T21:14:13.406Z] STF 17:14:13.080 - | Echo: ECHO_ON
[2024-09-04T21:14:13.406Z] STF 17:14:13.080 - | Expectation: CLEAN_RUN within 1m
[2024-09-04T21:14:13.406Z] STF 17:14:13.080 - |
[2024-09-04T21:14:13.406Z] STF 17:14:13.080 - Running command: /Users/admin/workspace/workspace/Test_openjdk17_hs_sanity.system_aarch64_mac_testList_1/jdkbinary/j2sdk-image/Contents/Home/bin/java --add-reads com.test=ALL-UNNAMED --module-path /Users/admin/workspace/workspace/Test_openjdk17_hs_sanity.system_aarch64_mac_testList_1/jvmtest/system/aqa-systemtest/openjdk.test.modularity/bin/common-mods:/Users/admin/workspace/workspace/Test_openjdk17_hs_sanity.system_aarch64_mac_testList_1/jvmtest/system/aqa-systemtest/openjdk.test.modularity/bin/tests --add-modules=com.test --add-exports com.hello/adoptopenjdk.test.modularity.newpkg=com.test --patch-module com.hello=/Users/admin/workspace/workspace/Test_openjdk17_hs_sanity.system_aarch64_mac_testList_1/jvmtest/system/aqa-systemtest/openjdk.test.modularity/bin/common-override/com.hello:/Users/admin/workspace/workspace/Test_openjdk17_hs_sanity.system_aarch64_mac_testList_1/jvmtest/system/aqa-systemtest/openjdk.test.modularity/bin/common-override-new/com.hello -XX:-UseCompressedOops -classpath /Users/admin/workspace/testDependency/system_lib/junit/junit.jar:/Users/admin/workspace/testDependency/system_lib/junit/hamcrest-core.jar org.junit.runner.JUnitCore net.adoptopenjdk.test.modularity.junit.TestOverrideUsingMultipleFilePaths
[2024-09-04T21:14:13.406Z] STF 17:14:13.080 - Redirecting stderr to /Users/admin/workspace/workspace/Test_openjdk17_hs_sanity.system_aarch64_mac_testList_1/aqa-tests/TKG/output_17254819871481/PatMod_Adv_1/20240904-171412-PatModTest/results/4.OT56.stderr
[2024-09-04T21:14:13.407Z] STF 17:14:13.080 - Redirecting stdout to /Users/admin/workspace/workspace/Test_openjdk17_hs_sanity.system_aarch64_mac_testList_1/aqa-tests/TKG/output_17254819871481/PatMod_Adv_1/20240904-171412-PatModTest/results/4.OT56.stdout
[2024-09-04T21:14:13.407Z] STF 17:14:13.081 - Monitoring processes: OT56
[2024-09-04T21:14:13.407Z] OT56 stderr WARNING: module-info.class ignored in patch: /Users/admin/workspace/workspace/Test_openjdk17_hs_sanity.system_aarch64_mac_testList_1/jvmtest/system/aqa-systemtest/openjdk.test.modularity/bin/common-override/com.hello
[2024-09-04T21:14:13.407Z] OT56 stderr WARNING: module-info.class ignored in patch: /Users/admin/workspace/workspace/Test_openjdk17_hs_sanity.system_aarch64_mac_testList_1/jvmtest/system/aqa-systemtest/openjdk.test.modularity/bin/common-override-new/com.hello
[2024-09-04T21:14:13.407Z] OT56 JUnit version 4.12
[2024-09-04T21:14:13.407Z] OT56 ...
[2024-09-04T21:14:13.407Z] OT56 Time: 0.003
[2024-09-04T21:14:13.407Z] OT56
[2024-09-04T21:14:13.407Z] OT56 OK (3 tests)
[2024-09-04T21:14:13.407Z] OT56
[2024-09-04T21:14:13.407Z] STF 17:14:13.225 - Monitoring Report Summary:
[2024-09-04T21:14:13.407Z] STF 17:14:13.225 - o Process OT56 ended with the expected exit code (0)
[2024-09-04T21:14:13.407Z] STF 17:14:13.225 -
[2024-09-04T21:14:13.407Z] STF 17:14:13.225 - +------ Step 5 - (Negative test) Verify if a module can be specified only once on --patch-module
[2024-09-04T21:14:13.407Z] STF 17:14:13.225 - | Run foreground process
[2024-09-04T21:14:13.407Z] STF 17:14:13.225 - | Program: /Users/admin/workspace/workspace/Test_openjdk17_hs_sanity.system_aarch64_mac_testList_1/jdkbinary/j2sdk-image/Contents/Home/bin/java
[2024-09-04T21:14:13.407Z] STF 17:14:13.225 - | Mnemonic: OT7
[2024-09-04T21:14:13.407Z] STF 17:14:13.225 - | Echo: ECHO_ON
[2024-09-04T21:14:13.407Z] STF 17:14:13.225 - | Expectation: NON_ZERO_EXIT [1] within 1m
[2024-09-04T21:14:13.407Z] STF 17:14:13.225 - |
[2024-09-04T21:14:13.407Z] STF 17:14:13.225 - Running command: /Users/admin/workspace/workspace/Test_openjdk17_hs_sanity.system_aarch64_mac_testList_1/jdkbinary/j2sdk-image/Contents/Home/bin/java --add-reads com.test=ALL-UNNAMED --module-path /Users/admin/workspace/workspace/Test_openjdk17_hs_sanity.system_aarch64_mac_testList_1/jvmtest/system/aqa-systemtest/openjdk.test.modularity/bin/common-mods:/Users/admin/workspace/workspace/Test_openjdk17_hs_sanity.system_aarch64_mac_testList_1/jvmtest/system/aqa-systemtest/openjdk.test.modularity/bin/tests --add-modules=com.test --patch-module com.hello=/Users/admin/workspace/workspace/Test_openjdk17_hs_sanity.system_aarch64_mac_testList_1/jvmtest/system/aqa-systemtest/openjdk.test.modularity/bin/common-override-new/com.hello --patch-module com.hello=/Users/admin/workspace/workspace/Test_openjdk17_hs_sanity.system_aarch64_mac_testList_1/jvmtest/system/aqa-systemtest/openjdk.test.modularity/bin/common-override/com.hello -XX:-UseCompressedOops -classpath /Users/admin/workspace/testDependency/system_lib/junit/junit.jar:/Users/admin/workspace/testDependency/system_lib/junit/hamcrest-core.jar org.junit.runner.JUnitCore net.adoptopenjdk.test.modularity.junit.TestOverrideUsingAppModule
[2024-09-04T21:14:13.407Z] STF 17:14:13.225 - Redirecting stderr to /Users/admin/workspace/workspace/Test_openjdk17_hs_sanity.system_aarch64_mac_testList_1/aqa-tests/TKG/output_17254819871481/PatMod_Adv_1/20240904-171412-PatModTest/results/5.OT7.stderr
[2024-09-04T21:14:13.407Z] STF 17:14:13.225 - Redirecting stdout to /Users/admin/workspace/workspace/Test_openjdk17_hs_sanity.system_aarch64_mac_testList_1/aqa-tests/TKG/output_17254819871481/PatMod_Adv_1/20240904-171412-PatModTest/results/5.OT7.stdout
[2024-09-04T21:14:13.407Z] STF 17:14:13.226 - Monitoring processes: OT7
[2024-09-04T21:14:13.407Z] OT7 Error occurred during initialization of boot layer
[2024-09-04T21:14:13.407Z] OT7 java.lang.ExceptionInInitializerError
[2024-09-04T21:14:13.407Z] OT7 Caused by: java.lang.RuntimeException: com.hello specified more than once to --patch-module
[2024-09-04T21:14:13.774Z] STF 17:14:13.271 - Monitoring Report Summary:
[2024-09-04T21:14:13.774Z] STF 17:14:13.271 - o Process OT7 ended with the expected exit code (1)
[2024-09-04T21:14:13.774Z] STF 17:14:13.271 -
[2024-09-04T21:14:13.774Z] STF 17:14:13.271 - +------ Step 6 - Combine stderr and stdout files of process OT7
[2024-09-04T21:14:13.774Z] STF 17:14:13.271 - | Run foreground process
[2024-09-04T21:14:13.774Z] STF 17:14:13.271 - | Program: /Users/admin/workspace/workspace/Test_openjdk17_hs_sanity.system_aarch64_mac_testList_1/jdkbinary/j2sdk-image/Contents/Home/bin/java
[2024-09-04T21:14:13.774Z] STF 17:14:13.271 - | Mnemonic: CO
[2024-09-04T21:14:13.774Z] STF 17:14:13.271 - | Echo: ECHO_OFF
[2024-09-04T21:14:13.774Z] STF 17:14:13.271 - | Expectation: NON_ZERO_EXIT [0] within 30s
[2024-09-04T21:14:13.774Z] STF 17:14:13.271 - |
[2024-09-04T21:14:13.774Z] STF 17:14:13.271 - Running command: /Users/admin/workspace/workspace/Test_openjdk17_hs_sanity.system_aarch64_mac_testList_1/jdkbinary/j2sdk-image/Contents/Home/bin/java -Dfile1=/Users/admin/workspace/workspace/Test_openjdk17_hs_sanity.system_aarch64_mac_testList_1/aqa-tests/TKG/output_17254819871481/PatMod_Adv_1/20240904-171412-PatModTest/results/5.OT7.stdout -Dfile2=/Users/admin/workspace/workspace/Test_openjdk17_hs_sanity.system_aarch64_mac_testList_1/aqa-tests/TKG/output_17254819871481/PatMod_Adv_1/20240904-171412-PatModTest/results/5.OT7.stderr -Dfinal.file=/Users/admin/workspace/workspace/Test_openjdk17_hs_sanity.system_aarch64_mac_testList_1/aqa-tests/TKG/output_17254819871481/PatMod_Adv_1/20240904-171412-PatModTest/results/combinedOT7.txt -XX:-UseCompressedOops -classpath /Users/admin/workspace/workspace/Test_openjdk17_hs_sanity.system_aarch64_mac_testList_1/jvmtest/system/STF/stf.core/bin:/Users/admin/workspace/workspace/Test_openjdk17_hs_sanity.system_aarch64_mac_testList_1/jvmtest/system/aqa-systemtest/openjdk.test.modularity/bin net.adoptopenjdk.test.modularity.TestUtil
[2024-09-04T21:14:13.774Z] STF 17:14:13.271 - Redirecting stderr to /Users/admin/workspace/workspace/Test_openjdk17_hs_sanity.system_aarch64_mac_testList_1/aqa-tests/TKG/output_17254819871481/PatMod_Adv_1/20240904-171412-PatModTest/results/6.CO.stderr
[2024-09-04T21:14:13.774Z] STF 17:14:13.271 - Redirecting stdout to /Users/admin/workspace/workspace/Test_openjdk17_hs_sanity.system_aarch64_mac_testList_1/aqa-tests/TKG/output_17254819871481/PatMod_Adv_1/20240904-171412-PatModTest/results/6.CO.stdout
[2024-09-04T21:14:13.774Z] STF 17:14:13.272 - Monitoring processes: CO
[2024-09-04T21:14:13.774Z] STF 17:14:13.330 - Monitoring Report Summary:
[2024-09-04T21:14:13.774Z] STF 17:14:13.330 - o Process CO ended with the expected exit code (0)
[2024-09-04T21:14:13.774Z] STF 17:14:13.330 -
[2024-09-04T21:14:13.774Z] STF 17:14:13.330 - +------ Step 7 - Check output
[2024-09-04T21:14:13.774Z] STF 17:14:13.330 - | Count file matches
[2024-09-04T21:14:13.774Z] STF 17:14:13.330 - | TargetFile: /Users/admin/workspace/workspace/Test_openjdk17_hs_sanity.system_aarch64_mac_testList_1/aqa-tests/TKG/output_17254819871481/PatMod_Adv_1/20240904-171412-PatModTest/results/combinedOT7.txt
[2024-09-04T21:14:13.774Z] STF 17:14:13.330 - | ExpectedNumMatches: 1
[2024-09-04T21:14:13.774Z] STF 17:14:13.330 - | SearchStrings: ["java.lang.ExceptionInInitializerError"]
[2024-09-04T21:14:13.774Z] STF 17:14:13.330 - |
[2024-09-04T21:14:13.774Z] STF 17:14:13.330 - Found 1 instances of ["java.lang.ExceptionInInitializerError"]
[2024-09-04T21:14:13.774Z] STF 17:14:13.330 -
[2024-09-04T21:14:13.774Z] STF 17:14:13.330 - +------ Step 8 - (Negative test) Verify if --patch-module allows replacing of module-info.class
[2024-09-04T21:14:13.774Z] STF 17:14:13.330 - | Run foreground process
[2024-09-04T21:14:13.774Z] STF 17:14:13.330 - | Program: /Users/admin/workspace/workspace/Test_openjdk17_hs_sanity.system_aarch64_mac_testList_1/jdkbinary/j2sdk-image/Contents/Home/bin/java
[2024-09-04T21:14:13.774Z] STF 17:14:13.330 - | Mnemonic: OT8
[2024-09-04T21:14:13.774Z] STF 17:14:13.330 - | Echo: ECHO_ON
[2024-09-04T21:14:13.774Z] STF 17:14:13.330 - | Expectation: NON_ZERO_EXIT [1] within 1m
[2024-09-04T21:14:13.774Z] STF 17:14:13.330 - |
[2024-09-04T21:14:13.774Z] STF 17:14:13.331 - Running command: /Users/admin/workspace/workspace/Test_openjdk17_hs_sanity.system_aarch64_mac_testList_1/jdkbinary/j2sdk-image/Contents/Home/bin/java --add-reads com.test=ALL-UNNAMED --module-path /Users/admin/workspace/workspace/Test_openjdk17_hs_sanity.system_aarch64_mac_testList_1/jvmtest/system/aqa-systemtest/openjdk.test.modularity/bin/common-mods:/Users/admin/workspace/workspace/Test_openjdk17_hs_sanity.system_aarch64_mac_testList_1/jvmtest/system/aqa-systemtest/openjdk.test.modularity/bin/tests --add-modules=com.test --patch-module com.hello=/Users/admin/workspace/workspace/Test_openjdk17_hs_sanity.system_aarch64_mac_testList_1/jvmtest/system/aqa-systemtest/openjdk.test.modularity/bin/common-override-new/com.hello -XX:-UseCompressedOops -classpath /Users/admin/workspace/testDependency/system_lib/junit/junit.jar:/Users/admin/workspace/testDependency/system_lib/junit/hamcrest-core.jar org.junit.runner.JUnitCore net.adoptopenjdk.test.modularity.junit.TestOverrideUsingUnexportedPublicType
[2024-09-04T21:14:13.774Z] STF 17:14:13.331 - Redirecting stderr to /Users/admin/workspace/workspace/Test_openjdk17_hs_sanity.system_aarch64_mac_testList_1/aqa-tests/TKG/output_17254819871481/PatMod_Adv_1/20240904-171412-PatModTest/results/8.OT8.stderr
[2024-09-04T21:14:13.774Z] STF 17:14:13.331 - Redirecting stdout to /Users/admin/workspace/workspace/Test_openjdk17_hs_sanity.system_aarch64_mac_testList_1/aqa-tests/TKG/output_17254819871481/PatMod_Adv_1/20240904-171412-PatModTest/results/8.OT8.stdout
[2024-09-04T21:14:13.774Z] STF 17:14:13.332 - Monitoring processes: OT8
[2024-09-04T21:14:13.774Z] OT8 stderr WARNING: module-info.class ignored in patch: /Users/admin/workspace/workspace/Test_openjdk17_hs_sanity.system_aarch64_mac_testList_1/jvmtest/system/aqa-systemtest/openjdk.test.modularity/bin/common-override-new/com.hello
[2024-09-04T21:14:13.774Z] OT8 JUnit version 4.12
[2024-09-04T21:14:13.774Z] OT8 .E
[2024-09-04T21:14:13.774Z] OT8 Time: 0.002
[2024-09-04T21:14:13.774Z] OT8 There was 1 failure:
[2024-09-04T21:14:13.774Z] OT8 1) testPatchingOfNewClassInExistingPackage(net.adoptopenjdk.test.modularity.junit.TestOverrideUsingUnexportedPublicType)
[2024-09-04T21:14:13.774Z] OT8 java.lang.IllegalAccessException: class net.adoptopenjdk.test.modularity.junit.TestOverrideUsingUnexportedPublicType (in module com.test) cannot access class adoptopenjdk.test.modularity.newpkg.NewClass2 (in module com.hello) because module com.hello does not export adoptopenjdk.test.modularity.newpkg to module com.test
[2024-09-04T21:14:13.774Z] OT8 at java.base/jdk.internal.reflect.Reflection.newIllegalAccessException(Reflection.java:392)
[2024-09-04T21:14:13.774Z] OT8 at java.base/java.lang.reflect.AccessibleObject.checkAccess(AccessibleObject.java:674)
[2024-09-04T21:14:13.774Z] OT8 at java.base/java.lang.reflect.Constructor.newInstanceWithCaller(Constructor.java:490)
[2024-09-04T21:14:13.774Z] OT8 at java.base/java.lang.reflect.Constructor.newInstance(Constructor.java:481)
[2024-09-04T21:14:13.774Z] OT8 at com.test/net.adoptopenjdk.test.modularity.junit.TestOverrideUsingUnexportedPublicType.testPatchingOfNewClassInExistingPackage(TestOverrideUsingUnexportedPublicType.java:34)
[2024-09-04T21:14:13.774Z] OT8 at java.base/jdk.internal.reflect.NativeMethodAccessorImpl.invoke0(Native Method)
[2024-09-04T21:14:13.774Z] OT8 at java.base/jdk.internal.reflect.NativeMethodAccessorImpl.invoke(NativeMethodAccessorImpl.java:77)
[2024-09-04T21:14:13.774Z] OT8 at java.base/jdk.internal.reflect.DelegatingMethodAccessorImpl.invoke(DelegatingMethodAccessorImpl.java:43)
[2024-09-04T21:14:13.774Z] OT8 at java.base/java.lang.reflect.Method.invoke(Method.java:569)
[2024-09-04T21:14:13.774Z] OT8 at org.junit.runners.model.FrameworkMethod$1.runReflectiveCall(FrameworkMethod.java:50)
[2024-09-04T21:14:13.774Z] OT8 at org.junit.internal.runners.model.ReflectiveCallable.run(ReflectiveCallable.java:12)
[2024-09-04T21:14:13.774Z] OT8 at org.junit.runners.model.FrameworkMethod.invokeExplosively(FrameworkMethod.java:47)
[2024-09-04T21:14:13.774Z] OT8 at org.junit.internal.runners.statements.InvokeMethod.evaluate(InvokeMethod.java:17)
[2024-09-04T21:14:13.774Z] OT8 at org.junit.runners.ParentRunner.runLeaf(ParentRunner.java:325)
[2024-09-04T21:14:13.774Z] OT8 at org.junit.runners.BlockJUnit4ClassRunner.runChild(BlockJUnit4ClassRunner.java:78)
[2024-09-04T21:14:13.774Z] OT8 at org.junit.runners.BlockJUnit4ClassRunner.runChild(BlockJUnit4ClassRunner.java:57)
[2024-09-04T21:14:13.774Z] OT8 at org.junit.runners.ParentRunner$3.run(ParentRunner.java:290)
[2024-09-04T21:14:13.774Z] OT8 at org.junit.runners.ParentRunner$1.schedule(ParentRunner.java:71)
[2024-09-04T21:14:13.774Z] OT8 at org.junit.runners.ParentRunner.runChildren(ParentRunner.java:288)
[2024-09-04T21:14:13.774Z] OT8 at org.junit.runners.ParentRunner.access$000(ParentRunner.java:58)
[2024-09-04T21:14:13.774Z] OT8 at org.junit.runners.ParentRunner$2.evaluate(ParentRunner.java:268)
[2024-09-04T21:14:13.774Z] OT8 at org.junit.runners.ParentRunner.run(ParentRunner.java:363)
[2024-09-04T21:14:13.774Z] OT8 at org.junit.runners.Suite.runChild(Suite.java:128)
[2024-09-04T21:14:13.774Z] OT8 at org.junit.runners.Suite.runChild(Suite.java:27)
[2024-09-04T21:14:13.774Z] OT8 at org.junit.runners.ParentRunner$3.run(ParentRunner.java:290)
[2024-09-04T21:14:13.774Z] OT8 at org.junit.runners.ParentRunner$1.schedule(ParentRunner.java:71)
[2024-09-04T21:14:13.774Z] OT8 at org.junit.runners.ParentRunner.runChildren(ParentRunner.java:288)
[2024-09-04T21:14:13.774Z] OT8 at org.junit.runners.ParentRunner.access$000(ParentRunner.java:58)
[2024-09-04T21:14:13.774Z] OT8 at org.junit.runners.ParentRunner$2.evaluate(ParentRunner.java:268)
[2024-09-04T21:14:13.774Z] OT8 at org.junit.runners.ParentRunner.run(ParentRunner.java:363)
[2024-09-04T21:14:13.774Z] OT8 at org.junit.runner.JUnitCore.run(JUnitCore.java:137)
[2024-09-04T21:14:13.774Z] OT8 at org.junit.runner.JUnitCore.run(JUnitCore.java:115)
[2024-09-04T21:14:13.774Z] OT8 at org.junit.runner.JUnitCore.runMain(JUnitCore.java:77)
[2024-09-04T21:14:13.774Z] OT8 at org.junit.runner.JUnitCore.main(JUnitCore.java:36)
[2024-09-04T21:14:13.774Z] OT8
[2024-09-04T21:14:13.774Z] OT8 FAILURES!!!
[2024-09-04T21:14:13.774Z] OT8 Tests run: 1, Failures: 1
[2024-09-04T21:14:13.774Z] OT8
[2024-09-04T21:14:13.774Z] STF 17:14:13.481 - Monitoring Report Summary:
[2024-09-04T21:14:13.774Z] STF 17:14:13.481 - o Process OT8 ended with the expected exit code (1)
[2024-09-04T21:14:13.774Z] STF 17:14:13.481 -
[2024-09-04T21:14:13.774Z] STF 17:14:13.481 - +------ Step 9 - Check output
[2024-09-04T21:14:13.774Z] STF 17:14:13.481 - | Count file matches
[2024-09-04T21:14:13.774Z] STF 17:14:13.481 - | TargetFile: /Users/admin/workspace/workspace/Test_openjdk17_hs_sanity.system_aarch64_mac_testList_1/aqa-tests/TKG/output_17254819871481/PatMod_Adv_1/20240904-171412-PatModTest/results/8.OT8.stdout
[2024-09-04T21:14:13.774Z] STF 17:14:13.481 - | ExpectedNumMatches: 1
[2024-09-04T21:14:13.774Z] STF 17:14:13.481 - | SearchStrings: ["java.lang.IllegalAccessException"]
[2024-09-04T21:14:13.774Z] STF 17:14:13.481 - |
[2024-09-04T21:14:13.774Z] STF 17:14:13.481 - Found 1 instances of ["java.lang.IllegalAccessException"]
[2024-09-04T21:14:13.774Z] STF 17:14:13.481 - EXECUTE stage completed
[2024-09-04T21:14:13.774Z] STF 17:14:13.490 -
[2024-09-04T21:14:13.774Z] STF 17:14:13.490 - ==================== T E A R D O W N ====================
[2024-09-04T21:14:13.775Z] STF 17:14:13.490 - Running teardown: perl /Users/admin/workspace/workspace/Test_openjdk17_hs_sanity.system_aarch64_mac_testList_1/aqa-tests/TKG/../TKG/output_17254819871481/PatMod_Adv_1/20240904-171412-PatModTest/tearDown.pl
[2024-09-04T21:14:13.775Z] STF 17:14:13.518 - TEARDOWN stage completed
[2024-09-04T21:14:13.775Z] STF 17:14:13.530 -
[2024-09-04T21:14:13.775Z] STF 17:14:13.530 - ===================== R E S U L T S =====================
[2024-09-04T21:14:13.775Z] STF 17:14:13.530 - Stage results:
[2024-09-04T21:14:13.775Z] STF 17:14:13.530 - setUp: pass
[2024-09-04T21:14:13.775Z] STF 17:14:13.530 - execute: pass
[2024-09-04T21:14:13.775Z] STF 17:14:13.530 - teardown: pass
[2024-09-04T21:14:13.775Z] STF 17:14:13.530 -
[2024-09-04T21:14:13.775Z] STF 17:14:13.530 - Overall result: PASSED
[2024-09-04T21:14:13.775Z] -----------------------------------
[2024-09-04T21:14:13.775Z] PatMod_Adv_1_PASSED
[2024-09-04T21:14:13.775Z] -----------------------------------
[2024-09-04T21:14:13.775Z]
[2024-09-04T21:14:13.775Z] TEST TEARDOWN:
[2024-09-04T21:14:13.775Z] Nothing to be done for teardown.
[2024-09-04T21:14:13.775Z] PatMod_Adv_1 Finish Time: Wed Sep 4 17:14:13 2024 Epoch Time (ms): 1725484453546